BDBM50135740 2,3,4,5,6,7,14,15-octahydroxy-13-(5-hydroxy-4-oxo-2-phenyl-3,4-dihydro-2H-7-chromenyloxy)-9,11,11a,13,14,15,15a,17-octahydrodibenzo[g,i]pyrano[3,2-b][1,5]dioxacycloundecine-9,17-dione::CHEMBL100881::CHEMBL3215349
SMILES: O[C@@H]1[C@@H](O)[C@@H]2OC(=O)c3cc(O)c(O)c(O)c3-c3c(O)c(O)c(O)cc3C(=O)OC[C@H]2O[C@H]1Oc1cc(O)c2C(=O)CC(Oc2c1)c1ccccc1
InChI Key: InChIKey=SHBQSNYBINOTIL-UHFFFAOYSA-N
Data: 2 IC50
Activity Spreadsheet -- Enzyme Inhibition Constant Data from BindingDB
Found 2 hits for monomerid = 50135740
Trg + Lig
Ki
nM
ΔG°
kcal/mole
IC50
nM
Kd
nM
EC50/IC50
nM
koff
s-1
kon
M-1s-1
pHTemp
°C
Hepatitis C virus serine protease, NS3/NS4A
(Hepatitis C virus)
BDBM50135740
(2,3,4,5,6,7,14,15-octahydroxy-13-(5-hydroxy-4-oxo-...)
Show SMILES O[C@@H]1[C@@H](O)[C@@H]2OC(=O)c3cc(O)c(O)c(O)c3-c3c(O)c(O)c(O)cc3C(=O)OC[C@H]2O[C@H]1Oc1cc(O)c2C(=O)CC(Oc2c1)c1ccccc1 |r|
Show InChI InChI=1S/C35H28O17/c36-16-6-13(7-21-25(16)17(37)10-20(50-21)12-4-2-1-3-5-12)49-35-31(45)30(44)32-22(51-35)11-48-33(46)14-8-18(38)26(40)28(42)23(14)24-15(34(47)52-32)9-19(39)27(41)29(24)43/h1-9,20,22,30-32,35-36,38-45H,10-11H2
n/an/a 300n/an/an/an/an/an/a
Schering-Plough Research Institute
Curated by ChEMBL
Assay Description
Inhibitory activity of the compound evaluated in the HCV NS3 protease activity assay
Bioorg Med Chem Lett 13: 2925-8 (2003)
BindingDB Entry DOI: 10.7270/Q2HX1C2D
Human rhinovirus A protease
(Human rhinovirus B)
BDBM50135740
(2,3,4,5,6,7,14,15-octahydroxy-13-(5-hydroxy-4-oxo-...)
Show SMILES O[C@@H]1[C@@H](O)[C@@H]2OC(=O)c3cc(O)c(O)c(O)c3-c3c(O)c(O)c(O)cc3C(=O)OC[C@H]2O[C@H]1Oc1cc(O)c2C(=O)CC(Oc2c1)c1ccccc1 |r|
Show InChI InChI=1S/C35H28O17/c36-16-6-13(7-21-25(16)17(37)10-20(50-21)12-4-2-1-3-5-12)49-35-31(45)30(44)32-22(51-35)11-48-33(46)14-8-18(38)26(40)28(42)23(14)24-15(34(47)52-32)9-19(39)27(41)29(24)43/h1-9,20,22,30-32,35-36,38-45H,10-11H2
n/an/a 2.80E+3n/an/an/an/an/an/a
Schering-Plough Research Institute
Curated by ChEMBL
Assay Description
Inhibitory activity of the compound evaluated in the HCV protease binding assay
Bioorg Med Chem Lett 13: 2925-8 (2003)
BindingDB Entry DOI: 10.7270/Q2HX1C2D