BDBM50135821 (Bis-phosphono-methyl)-cycloheptyl-ammonium::(Cycloheptylamino-phosphono-methyl)-phosphonic acid::(cycloheptylamino)methylenediphosphonic acid::(cyloheptylamino)methylene-1,1-bisphosphonate::CHEMBL53950::Incadronic acid
SMILES: OP(O)(O)C(=NC1CCCCCC1)P(O)(O)=O
InChI Key: InChIKey=SPRXFVYNBMUPLY-UHFFFAOYSA-N
Data: 1 KI  4 IC50
Activity Spreadsheet -- Enzyme Inhibition Constant Data from BindingDB
Found 5 hits for monomerid = 50135821
Trg + Lig
Ki
nM
ΔG°
kcal/mole
IC50
nM
Kd
nM
EC50/IC50
nM
koff
s-1
kon
M-1s-1
pHTemp
°C
Farnesyl diphosphate synthase
(Homo sapiens (Human))
BDBM50135821
((Bis-phosphono-methyl)-cycloheptyl-ammonium | (Cyc...)
Show SMILES OP(O)(O)C(=NC1CCCCCC1)P(O)(O)=O |w:5.5|
Show InChI InChI=1S/C8H19NO6P2/c10-16(11,12)8(17(13,14)15)9-7-5-3-1-2-4-6-7/h7,10-12,16H,1-6H2,(H2,13,14,15)
Reactome pathway
22n/an/an/an/an/an/an/an/a
University of Illinois at Urbana-Champaign
Curated by ChEMBL
Assay Description
Binding affinity towards farnesyl Pyrophosphate Synthase using [14C]- isopentenyl pyrophosphate as radioligand
J Med Chem 46: 5171-83 (2003)
Article DOI: 10.1021/jm0302344
BindingDB Entry DOI: 10.7270/Q24M93Z8
Farnesyl diphosphate synthase
(Homo sapiens (Human))
BDBM50135821
((Bis-phosphono-methyl)-cycloheptyl-ammonium | (Cyc...)
Show SMILES OP(O)(O)C(=NC1CCCCCC1)P(O)(O)=O |w:5.5|
Show InChI InChI=1S/C8H19NO6P2/c10-16(11,12)8(17(13,14)15)9-7-5-3-1-2-4-6-7/h7,10-12,16H,1-6H2,(H2,13,14,15)
Reactome pathway
n/an/a 229n/an/an/an/an/an/a
University of Illinois at Urbana-Champaign
Curated by ChEMBL
Assay Description
Inhibitory activity against farnesyl Pyrophosphate Synthase expressed as #NAME? (M)
J Med Chem 46: 5171-83 (2003)
Article DOI: 10.1021/jm0302344
BindingDB Entry DOI: 10.7270/Q24M93Z8
Vacuolar-type proton translocating pyrophosphatase 1
(Trypanosoma brucei)
BDBM50135821
((Bis-phosphono-methyl)-cycloheptyl-ammonium | (Cyc...)
Show SMILES OP(O)(O)C(=NC1CCCCCC1)P(O)(O)=O |w:5.5|
Show InChI InChI=1S/C8H19NO6P2/c10-16(11,12)8(17(13,14)15)9-7-5-3-1-2-4-6-7/h7,10-12,16H,1-6H2,(H2,13,14,15)
n/an/a 4.43E+4n/an/an/an/an/an/a
University of Illinois at Urbana-Champaign
Curated by ChEMBL
Assay Description
Inhibition of recombinant Trypanosoma brucei soluble vacuolar pyrophosphatase expressed in Escherichia coli
J Med Chem 48: 6128-39 (2005)
Article DOI: 10.1021/jm058220g
BindingDB Entry DOI: 10.7270/Q2F47PX2
Farnesyl diphosphate synthase
(Homo sapiens (Human))
BDBM50135821
((Bis-phosphono-methyl)-cycloheptyl-ammonium | (Cyc...)
Show SMILES OP(O)(O)C(=NC1CCCCCC1)P(O)(O)=O |w:5.5|
Show InChI InChI=1S/C8H19NO6P2/c10-16(11,12)8(17(13,14)15)9-7-5-3-1-2-4-6-7/h7,10-12,16H,1-6H2,(H2,13,14,15)
Reactome pathway
n/an/a 30n/an/an/an/an/an/a
Wroclaw University of Technology
Curated by ChEMBL
Assay Description
Inhibition of recombinant human FPPS expressed in Escherichia coli by scintillation counting
J Med Chem 54: 5955-80 (2011)
Article DOI: 10.1021/jm200587f
BindingDB Entry DOI: 10.7270/Q2PV6MGF
Farnesyl diphosphate synthase
(Homo sapiens (Human))
BDBM50135821
((Bis-phosphono-methyl)-cycloheptyl-ammonium | (Cyc...)
Show SMILES OP(O)(O)C(=NC1CCCCCC1)P(O)(O)=O |w:5.5|
Show InChI InChI=1S/C8H19NO6P2/c10-16(11,12)8(17(13,14)15)9-7-5-3-1-2-4-6-7/h7,10-12,16H,1-6H2,(H2,13,14,15)
Reactome pathway
n/an/a 230n/an/an/an/an/an/a
University of Illinois at Urbana-Champaign
Curated by ChEMBL
Assay Description
Inhibitory activity against farnesyl Pyrophosphate Synthase was determined
J Med Chem 46: 5171-83 (2003)
Article DOI: 10.1021/jm0302344
BindingDB Entry DOI: 10.7270/Q24M93Z8