BDBM50135845 Bicyclic Guanidinium Subunit::CHEMBL266754
SMILES: COC(=O)[C@H](Cc1ccccc1)NC(=O)[C@H](CC(N)=O)NC(=O)[C@H](CC(C)C)NC(=O)[C@@H](NC(=O)[C@H](C)NC(=O)CCCCC(=O)OC[C@@H]1CCN2CC[C@@H](CO[Si](c3ccccc3)(c3ccccc3)C(C)(C)C)[NH+]=C2N1)[C@@H](C)O
InChI Key: InChIKey=OKKRQBFAQJPHLS-URIKAWDGSA-O
Data: 1 KI  1 IC50
Activity Spreadsheet -- Enzyme Inhibition Constant Data from BindingDB
Found 2 hits for monomerid = 50135845
Trg + Lig
Ki
nM
ΔG°
kcal/mole
IC50
nM
Kd
nM
EC50/IC50
nM
koff
s-1
kon
M-1s-1
pHTemp
°C
Gag-Pol polyprotein [489-587]
(Human immunodeficiency virus type 1)
BDBM50135845
(Bicyclic Guanidinium Subunit | CHEMBL266754)
Show SMILES COC(=O)[C@H](Cc1ccccc1)NC(=O)[C@H](CC(N)=O)NC(=O)[C@H](CC(C)C)NC(=O)[C@@H](NC(=O)[C@H](C)NC(=O)CCCCC(=O)OC[C@@H]1CCN2CC[C@@H](CO[Si](c3ccccc3)(c3ccccc3)C(C)(C)C)[NH+]=C2N1)[C@@H](C)O |c:77|
Show InChI InChI=1S/C58H83N9O12Si/c1-37(2)32-45(53(73)63-46(34-48(59)69)54(74)65-47(56(76)77-8)33-40-20-12-9-13-21-40)64-55(75)51(39(4)68)66-52(72)38(3)60-49(70)26-18-19-27-50(71)78-35-41-28-30-67-31-29-42(62-57(67)61-41)36-79-80(58(5,6)7,43-22-14-10-15-23-43)44-24-16-11-17-25-44/h9-17,20-25,37-39,41-42,45-47,51,68H,18-19,26-36H2,1-8H3,(H2,59,69)(H,60,70)(H,61,62)(H,63,73)(H,64,75)(H,65,74)(H,66,72)/p+1/t38-,39+,41-,42-,45-,46-,47-,51-/m0/s1
5.25E+3n/an/an/an/an/an/an/an/a
Universidad Aut£noma de Madrid
Curated by ChEMBL
Assay Description
Competitive inhibition against HIV-1 Protease
J Med Chem 46: 5196-207 (2003)
Article DOI: 10.1021/jm030871u
BindingDB Entry DOI: 10.7270/Q2C53MKZ
Gag-Pol polyprotein [489-587]
(Human immunodeficiency virus type 1)
BDBM50135845
(Bicyclic Guanidinium Subunit | CHEMBL266754)
Show SMILES COC(=O)[C@H](Cc1ccccc1)NC(=O)[C@H](CC(N)=O)NC(=O)[C@H](CC(C)C)NC(=O)[C@@H](NC(=O)[C@H](C)NC(=O)CCCCC(=O)OC[C@@H]1CCN2CC[C@@H](CO[Si](c3ccccc3)(c3ccccc3)C(C)(C)C)[NH+]=C2N1)[C@@H](C)O |c:77|
Show InChI InChI=1S/C58H83N9O12Si/c1-37(2)32-45(53(73)63-46(34-48(59)69)54(74)65-47(56(76)77-8)33-40-20-12-9-13-21-40)64-55(75)51(39(4)68)66-52(72)38(3)60-49(70)26-18-19-27-50(71)78-35-41-28-30-67-31-29-42(62-57(67)61-41)36-79-80(58(5,6)7,43-22-14-10-15-23-43)44-24-16-11-17-25-44/h9-17,20-25,37-39,41-42,45-47,51,68H,18-19,26-36H2,1-8H3,(H2,59,69)(H,60,70)(H,61,62)(H,63,73)(H,64,75)(H,65,74)(H,66,72)/p+1/t38-,39+,41-,42-,45-,46-,47-,51-/m0/s1
n/an/a 1.90E+3n/an/an/an/an/an/a
Universidad Aut£noma de Madrid
Curated by ChEMBL
Assay Description
In vitro inhibitory activity against HIV-1 Protease
J Med Chem 46: 5196-207 (2003)
Article DOI: 10.1021/jm030871u
BindingDB Entry DOI: 10.7270/Q2C53MKZ