null
SMILES: N[C@H](COc1ccccc1)c1ccccc1
InChI Key: InChIKey=VPMNXCAPTJKWHO-CQSZACIVSA-N
Activity Spreadsheet -- Enzyme Inhibition Constant Data from BindingDB
Found 1 hit for monomerid = 50135879
Trg + Lig
Ki
nM
ΔG°
kcal/mole
IC50
nM
Kd
nM
EC50/IC50
nM
koff
s-1
kon
M-1s-1
pHTemp
°C
Sodium channel protein type 4 subunit alpha
(Homo sapiens (Human))
BDBM50135879
((S)-2-Phenoxy-1-phenyl-ethylamine | (S)-2-phenoxy-...)
Show SMILES N[C@H](COc1ccccc1)c1ccccc1 |r|
Show InChI InChI=1S/C14H15NO/c15-14(12-7-3-1-4-8-12)11-16-13-9-5-2-6-10-13/h1-10,14H,11,15H2/t14-/m1/s1
n/an/an/an/a 1.58E+4n/an/an/an/a
Universit£ degli Studi di Bari
Curated by ChEMBL
Assay Description
Inhibition of Nav1.4 ion channel assessed as reduction in cumulative sodium current
Eur J Med Chem 44: 1477-85 (2009)
Article DOI: 10.1016/j.ejmech.2008.10.005
BindingDB Entry DOI: 10.7270/Q2M61MGC