BDBM50136012 12-(2-hydroxyethyl)-6,7,12,13-tetrahydro-5H-indeno[2,1-a]pyrrolo[4,3-c]carbazol-5-one::CHEMBL151219
SMILES: OCCn1c2ccccc2c2c3CNC(=O)c3c3-c4ccccc4Cc3c12
InChI Key: InChIKey=ZCZZYVNEKMMLLC-UHFFFAOYSA-N
Data: 1 IC50
Activity Spreadsheet -- Enzyme Inhibition Constant Data from BindingDB
Found 1 hit for monomerid = 50136012
Trg + Lig
Ki
nM
ΔG°
kcal/mole
IC50
nM
Kd
nM
EC50/IC50
nM
koff
s-1
kon
M-1s-1
pHTemp
°C
Vascular endothelial growth factor receptor 2
(Homo sapiens (Human))
BDBM50136012
(12-(2-hydroxyethyl)-6,7,12,13-tetrahydro-5H-indeno...)
Show SMILES OCCn1c2ccccc2c2c3CNC(=O)c3c3-c4ccccc4Cc3c12
Show InChI InChI=1S/C23H18N2O2/c26-10-9-25-18-8-4-3-7-15(18)20-17-12-24-23(27)21(17)19-14-6-2-1-5-13(14)11-16(19)22(20)25/h1-8,26H,9-12H2,(H,24,27)
NCI pathway
Reactome pathway
n/an/a 107n/an/an/an/an/an/a
Cephalon, Inc
Curated by ChEMBL
Assay Description
Inhibition of human Vascular endothelial growth factor receptor 2
J Med Chem 46: 5375-88 (2003)
Article DOI: 10.1021/jm0301641
BindingDB Entry DOI: 10.7270/Q2V69J1X