BDBM50136032 1-[12-(3-hydroxypropyl)-5-oxo-6,7,12,13-tetrahydro-5H-indeno[2,1-a]pyrrolo[4,3-c]carbazol-9-yl]-1-ethanone::CHEMBL359084
SMILES: CC(=O)c1ccc2n(CCCO)c3c4Cc5ccccc5-c4c4C(=O)NCc4c3c2c1
InChI Key: InChIKey=FDMBBJLAZOJMIS-UHFFFAOYSA-N
Data: 1 IC50
Activity Spreadsheet -- Enzyme Inhibition Constant Data from BindingDB
Found 1 hit for monomerid = 50136032
Trg + Lig
Ki
nM
ΔG°
kcal/mole
IC50
nM
Kd
nM
EC50/IC50
nM
koff
s-1
kon
M-1s-1
pHTemp
°C
Vascular endothelial growth factor receptor 2
(Homo sapiens (Human))
BDBM50136032
(1-[12-(3-hydroxypropyl)-5-oxo-6,7,12,13-tetrahydro...)
Show SMILES CC(=O)c1ccc2n(CCCO)c3c4Cc5ccccc5-c4c4C(=O)NCc4c3c2c1
Show InChI InChI=1S/C26H22N2O3/c1-14(30)15-7-8-21-18(11-15)23-20-13-27-26(31)24(20)22-17-6-3-2-5-16(17)12-19(22)25(23)28(21)9-4-10-29/h2-3,5-8,11,29H,4,9-10,12-13H2,1H3,(H,27,31)
NCI pathway
Reactome pathway
n/an/a 187n/an/an/an/an/an/a
Cephalon, Inc
Curated by ChEMBL
Assay Description
Inhibition of human Vascular endothelial growth factor receptor 2
J Med Chem 46: 5375-88 (2003)
Article DOI: 10.1021/jm0301641
BindingDB Entry DOI: 10.7270/Q2V69J1X