BDBM50136222 CHEMBL3754036
SMILES: O=C(Cc1ccccc1)NC1=NCCS1
InChI Key: InChIKey=KGFKAKZVVFAGSR-UHFFFAOYSA-N
Data: 1 IC50
Activity Spreadsheet -- Enzyme Inhibition Constant Data from BindingDB
Found 1 hit for monomerid = 50136222
Trg + Lig
Ki
nM
ΔG°
kcal/mole
IC50
nM
Kd
nM
EC50/IC50
nM
koff
s-1
kon
M-1s-1
pHTemp
°C
CviR transcriptional regulator
(Chromobacterium violaceum)
BDBM50136222
(CHEMBL3754036)
Show SMILES O=C(Cc1ccccc1)NC1=NCCS1 |t:11|
Show InChI InChI=1S/C11H12N2OS/c14-10(13-11-12-6-7-15-11)8-9-4-2-1-3-5-9/h1-5H,6-8H2,(H,12,13,14)
n/an/a 6.70E+5n/an/an/an/an/an/a
Instituto Polit£cnico Nacional
Curated by ChEMBL
Assay Description
Inhibition of CviR in Chromobacterium violaceum CV026 assessed as reduction of violacein production after 15 hrs
Bioorg Med Chem 23: 7565-77 (2015)
BindingDB Entry DOI: 10.7270/Q2RF5WVS