BDBM50136246 (S)-3-{(R)-2-Oxo-3-[3-(5,6,7,8-tetrahydro-[1,8]naphthyridin-2-yl)-propyl]-pyrrolidin-1-yl}-3-quinolin-3-yl-propionic acid::CHEMBL336830
SMILES: OC(=O)C[C@H](N1CC[C@@H](CCCc2ccc3CCCNc3n2)C1=O)c1cnc2ccccc2c1
InChI Key: InChIKey=ILIAIJBQDWEDLF-DVECYGJZSA-N
Data: 1 IC50
Activity Spreadsheet -- Enzyme Inhibition Constant Data from BindingDB
Found 1 hit for monomerid = 50136246
Trg + Lig
Ki
nM
ΔG°
kcal/mole
IC50
nM
Kd
nM
EC50/IC50
nM
koff
s-1
kon
M-1s-1
pHTemp
°C
Integrin alpha-V/beta-3
(Homo sapiens (Human))
BDBM50136246
((S)-3-{(R)-2-Oxo-3-[3-(5,6,7,8-tetrahydro-[1,8]nap...)
Show SMILES OC(=O)C[C@H](N1CC[C@@H](CCCc2ccc3CCCNc3n2)C1=O)c1cnc2ccccc2c1
Show InChI InChI=1S/C27H30N4O3/c32-25(33)16-24(21-15-20-5-1-2-9-23(20)29-17-21)31-14-12-19(27(31)34)6-3-8-22-11-10-18-7-4-13-28-26(18)30-22/h1-2,5,9-11,15,17,19,24H,3-4,6-8,12-14,16H2,(H,28,30)(H,32,33)/t19-,24+/m1/s1
n/an/a 0.130n/an/an/an/an/an/a
Merck Research Laboratories
Curated by ChEMBL
Assay Description
Displacement of [125I]-labeled nonpeptide from purified recombinant human alphaV-beta3 integrin
Bioorg Med Chem Lett 13: 4285-8 (2003)
BindingDB Entry DOI: 10.7270/Q25D8T08