BDBM50136391 CHEMBL3753212
SMILES: CC(C)Nc1cc(cc(C)n1)-c1nnc(s1)-c1cc(F)c(OC[C@H]2CCC(=O)N2)cc1Cl
InChI Key: InChIKey=LGODQJDLYGIZAT-CQSZACIVSA-N
Data: 1 EC50
Activity Spreadsheet -- Enzyme Inhibition Constant Data from BindingDB
Found 1 hit for monomerid = 50136391
Trg + Lig
Ki
nM
ΔG°
kcal/mole
IC50
nM
Kd
nM
EC50/IC50
nM
koff
s-1
kon
M-1s-1
pHTemp
°C
Sphingosine 1-phosphate receptor 1
(Homo sapiens (Human))
BDBM50136391
(CHEMBL3753212)
Show SMILES CC(C)Nc1cc(cc(C)n1)-c1nnc(s1)-c1cc(F)c(OC[C@H]2CCC(=O)N2)cc1Cl |r|
Show InChI InChI=1S/C22H23ClFN5O2S/c1-11(2)25-19-7-13(6-12(3)26-19)21-28-29-22(32-21)15-8-17(24)18(9-16(15)23)31-10-14-4-5-20(30)27-14/h6-9,11,14H,4-5,10H2,1-3H3,(H,25,26)(H,27,30)/t14-/m1/s1
Reactome pathway
n/an/an/an/a 330n/an/an/an/a
Boehringer Ingelheim Pharmaceuticals
Curated by ChEMBL
Assay Description
Agonist activity at human S1P1 receptor expressed in EDG1-bla U2OS cells incubated for 18 hrs prior to GenBlazer substrate addition by beta-arrestin ...
Bioorg Med Chem Lett 26: 466-71 (2016)
BindingDB Entry DOI: 10.7270/Q2GX4DD4