BDBM50136393 CHEMBL3754698
SMILES: CC(C)Nc1cc(cc(C)n1)-c1nnc(s1)-c1cc(F)c(OC[C@H]2COCCN2C(C)=O)cc1Cl
InChI Key: InChIKey=HQXWMQPHFAEFTF-QGZVFWFLSA-N
Data: 1 EC50
Activity Spreadsheet -- Enzyme Inhibition Constant Data from BindingDB
Found 1 hit for monomerid = 50136393
Trg + Lig
Ki
nM
ΔG°
kcal/mole
IC50
nM
Kd
nM
EC50/IC50
nM
koff
s-1
kon
M-1s-1
pHTemp
°C
Sphingosine 1-phosphate receptor 1
(Homo sapiens (Human))
BDBM50136393
(CHEMBL3754698)
Show SMILES CC(C)Nc1cc(cc(C)n1)-c1nnc(s1)-c1cc(F)c(OC[C@H]2COCCN2C(C)=O)cc1Cl |r|
Show InChI InChI=1S/C24H27ClFN5O3S/c1-13(2)27-22-8-16(7-14(3)28-22)23-29-30-24(35-23)18-9-20(26)21(10-19(18)25)34-12-17-11-33-6-5-31(17)15(4)32/h7-10,13,17H,5-6,11-12H2,1-4H3,(H,27,28)/t17-/m1/s1
Reactome pathway
n/an/an/an/a 310n/an/an/an/a
Boehringer Ingelheim Pharmaceuticals
Curated by ChEMBL
Assay Description
Agonist activity at human S1P1 receptor expressed in EDG1-bla U2OS cells incubated for 18 hrs prior to GenBlazer substrate addition by beta-arrestin ...
Bioorg Med Chem Lett 26: 466-71 (2016)
BindingDB Entry DOI: 10.7270/Q2GX4DD4