BDBM50136493 1-Methyl-4,9-dihydro-3H-beta-carboline::1-methyl-4,9-dihydro-3H-pyrido[3,4-b]indole::CHEMBL295234
SMILES: CC1=NCCc2c1[nH]c1ccccc21
InChI Key: InChIKey=CWOYLIJQLSNRRN-UHFFFAOYSA-N
Data: 16 KI
Activity Spreadsheet -- Enzyme Inhibition Constant Data from BindingDB
Found 16 hits for monomerid = 50136493
Trg + Lig
Ki
nM
ΔG°
kcal/mole
IC50
nM
Kd
nM
EC50/IC50
nM
koff
s-1
kon
M-1s-1
pHTemp
°C
Imidazoline receptor 1 (I1R)
(Homo sapiens (Human))
BDBM50136493
(1-Methyl-4,9-dihydro-3H-beta-carboline | 1-methyl-...)
Show SMILES CC1=NCCc2c1[nH]c1ccccc21 |t:1|
Show InChI InChI=1S/C12H12N2/c1-8-12-10(6-7-13-8)9-4-2-3-5-11(9)14-12/h2-5,14H,6-7H2,1H3
46n/an/an/an/an/an/an/an/a
Virginia Commonwealth University
Curated by ChEMBL
Assay Description
Binding affinity towards Imidazoline I1 receptor
Bioorg Med Chem Lett 13: 4421-5 (2003)
BindingDB Entry DOI: 10.7270/Q2D21X2G
Nischarin
(Homo sapiens (Human))
BDBM50136493
(1-Methyl-4,9-dihydro-3H-beta-carboline | 1-methyl-...)
Show SMILES CC1=NCCc2c1[nH]c1ccccc21 |t:1|
Show InChI InChI=1S/C12H12N2/c1-8-12-10(6-7-13-8)9-4-2-3-5-11(9)14-12/h2-5,14H,6-7H2,1H3
148n/an/an/an/an/an/an/an/a
Virginia Commonwealth University
Curated by ChEMBL
Assay Description
Binding affinity for rat 5-hydroxytryptamine 2A receptor using [3H]-DOB
Bioorg Med Chem Lett 13: 4421-5 (2003)
BindingDB Entry DOI: 10.7270/Q2D21X2G
5-hydroxytryptamine receptor 7
(Homo sapiens (Human))
BDBM50136493
(1-Methyl-4,9-dihydro-3H-beta-carboline | 1-methyl-...)
Show SMILES CC1=NCCc2c1[nH]c1ccccc21 |t:1|
Show InChI InChI=1S/C12H12N2/c1-8-12-10(6-7-13-8)9-4-2-3-5-11(9)14-12/h2-5,14H,6-7H2,1H3
Reactome pathway
280n/an/an/an/an/an/an/an/a
Virginia Commonwealth University
Curated by ChEMBL
Assay Description
Binding affinity towards 5-hydroxytryptamine 7 receptor
Bioorg Med Chem Lett 13: 4421-5 (2003)
BindingDB Entry DOI: 10.7270/Q2D21X2G
5-hydroxytryptamine receptor 5A
(Homo sapiens (Human))
BDBM50136493
(1-Methyl-4,9-dihydro-3H-beta-carboline | 1-methyl-...)
Show SMILES CC1=NCCc2c1[nH]c1ccccc21 |t:1|
Show InChI InChI=1S/C12H12N2/c1-8-12-10(6-7-13-8)9-4-2-3-5-11(9)14-12/h2-5,14H,6-7H2,1H3
845n/an/an/an/an/an/an/an/a
Virginia Commonwealth University
Curated by ChEMBL
Assay Description
Binding affinity towards 5-HT5A receptor
Bioorg Med Chem Lett 13: 4421-5 (2003)
BindingDB Entry DOI: 10.7270/Q2D21X2G
5-hydroxytryptamine receptor 2A
(Rattus norvegicus (rat))
BDBM50136493
(1-Methyl-4,9-dihydro-3H-beta-carboline | 1-methyl-...)
Show SMILES CC1=NCCc2c1[nH]c1ccccc21 |t:1|
Show InChI InChI=1S/C12H12N2/c1-8-12-10(6-7-13-8)9-4-2-3-5-11(9)14-12/h2-5,14H,6-7H2,1H3
Reactome pathway
1.15E+3n/an/an/an/an/an/an/an/a
Virginia Commonwealth University
Curated by ChEMBL
Assay Description
Binding affinity towards 5-hydroxytryptamine 2A receptor
Bioorg Med Chem Lett 13: 4421-5 (2003)
BindingDB Entry DOI: 10.7270/Q2D21X2G
5-hydroxytryptamine receptor 6
(Homo sapiens (Human))
BDBM50136493
(1-Methyl-4,9-dihydro-3H-beta-carboline | 1-methyl-...)
Show SMILES CC1=NCCc2c1[nH]c1ccccc21 |t:1|
Show InChI InChI=1S/C12H12N2/c1-8-12-10(6-7-13-8)9-4-2-3-5-11(9)14-12/h2-5,14H,6-7H2,1H3
Reactome pathway
1.45E+3n/an/an/an/an/an/an/an/a
Virginia Commonwealth University
Curated by ChEMBL
Assay Description
Binding affinity towards human 5-hydroxytryptamine 6 receptor
Bioorg Med Chem Lett 13: 4421-5 (2003)
BindingDB Entry DOI: 10.7270/Q2D21X2G
5-hydroxytryptamine receptor 1A
(Homo sapiens (Human))
BDBM50136493
(1-Methyl-4,9-dihydro-3H-beta-carboline | 1-methyl-...)
Show SMILES CC1=NCCc2c1[nH]c1ccccc21 |t:1|
Show InChI InChI=1S/C12H12N2/c1-8-12-10(6-7-13-8)9-4-2-3-5-11(9)14-12/h2-5,14H,6-7H2,1H3
>1.67E+3n/an/an/an/an/an/an/an/a
Virginia Commonwealth University
Curated by ChEMBL
Assay Description
Binding affinity towards 5-hydroxytryptamine 1A receptor
Bioorg Med Chem Lett 13: 4421-5 (2003)
BindingDB Entry DOI: 10.7270/Q2D21X2G
5-hydroxytryptamine receptor 2C
(Homo sapiens (Human))
BDBM50136493
(1-Methyl-4,9-dihydro-3H-beta-carboline | 1-methyl-...)
Show SMILES CC1=NCCc2c1[nH]c1ccccc21 |t:1|
Show InChI InChI=1S/C12H12N2/c1-8-12-10(6-7-13-8)9-4-2-3-5-11(9)14-12/h2-5,14H,6-7H2,1H3
Reactome pathway
1.86E+3n/an/an/an/an/an/an/an/a
Virginia Commonwealth University
Curated by ChEMBL
Assay Description
Binding affinity towards 5-hydroxytryptamine 2C receptor
Bioorg Med Chem Lett 13: 4421-5 (2003)
BindingDB Entry DOI: 10.7270/Q2D21X2G
Dopamine receptor
(Homo sapiens (Human))
BDBM50136493
(1-Methyl-4,9-dihydro-3H-beta-carboline | 1-methyl-...)
Show SMILES CC1=NCCc2c1[nH]c1ccccc21 |t:1|
Show InChI InChI=1S/C12H12N2/c1-8-12-10(6-7-13-8)9-4-2-3-5-11(9)14-12/h2-5,14H,6-7H2,1H3
Reactome pathway
>1.00E+4n/an/an/an/an/an/an/an/a
Virginia Commonwealth University
Curated by ChEMBL
Assay Description
Binding affinity towards cloned rat Inhibition of binding towards 5-hydroxytryptamine 2A receptor at 100 nM concentration was determined using [3H]-D...
Bioorg Med Chem Lett 13: 4421-5 (2003)
BindingDB Entry DOI: 10.7270/Q2D21X2G
Muscarinic acetylcholine receptor
(Homo sapiens (Human))
BDBM50136493
(1-Methyl-4,9-dihydro-3H-beta-carboline | 1-methyl-...)
Show SMILES CC1=NCCc2c1[nH]c1ccccc21 |t:1|
Show InChI InChI=1S/C12H12N2/c1-8-12-10(6-7-13-8)9-4-2-3-5-11(9)14-12/h2-5,14H,6-7H2,1H3
NCI pathway
Reactome pathway
>1.00E+4n/an/an/an/an/an/an/an/a
Virginia Commonwealth University
Curated by ChEMBL
Assay Description
Binding affinity for rat 5-hydroxytryptamine 2A receptor using [3H]-DOB
Bioorg Med Chem Lett 13: 4421-5 (2003)
BindingDB Entry DOI: 10.7270/Q2D21X2G
Metabotropic glutamate receptor
(Rattus norvegicus-Rattus norvegicus (Rat)-RAT)
BDBM50136493
(1-Methyl-4,9-dihydro-3H-beta-carboline | 1-methyl-...)
Show SMILES CC1=NCCc2c1[nH]c1ccccc21 |t:1|
Show InChI InChI=1S/C12H12N2/c1-8-12-10(6-7-13-8)9-4-2-3-5-11(9)14-12/h2-5,14H,6-7H2,1H3
>1.00E+4n/an/an/an/an/an/an/an/a
Virginia Commonwealth University
Curated by ChEMBL
Assay Description
Binding affinity towards Alpha-2B adrenergic receptor
Bioorg Med Chem Lett 13: 4421-5 (2003)
BindingDB Entry DOI: 10.7270/Q2D21X2G
SLC6A3
(BOVINE)
BDBM50136493
(1-Methyl-4,9-dihydro-3H-beta-carboline | 1-methyl-...)
Show SMILES CC1=NCCc2c1[nH]c1ccccc21 |t:1|
Show InChI InChI=1S/C12H12N2/c1-8-12-10(6-7-13-8)9-4-2-3-5-11(9)14-12/h2-5,14H,6-7H2,1H3
>1.00E+4n/an/an/an/an/an/an/an/a
Virginia Commonwealth University
Curated by ChEMBL
Assay Description
Binding affinity towards DAT (bovine)
Bioorg Med Chem Lett 13: 4421-5 (2003)
BindingDB Entry DOI: 10.7270/Q2D21X2G
5-hydroxytryptamine receptor 1D
(Homo sapiens (Human))
BDBM50136493
(1-Methyl-4,9-dihydro-3H-beta-carboline | 1-methyl-...)
Show SMILES CC1=NCCc2c1[nH]c1ccccc21 |t:1|
Show InChI InChI=1S/C12H12N2/c1-8-12-10(6-7-13-8)9-4-2-3-5-11(9)14-12/h2-5,14H,6-7H2,1H3
Reactome pathway
>1.00E+4n/an/an/an/an/an/an/an/a
Virginia Commonwealth University
Curated by ChEMBL
Assay Description
Binding affinity towards 5-hydroxytryptamine 1D receptor
Bioorg Med Chem Lett 13: 4421-5 (2003)
BindingDB Entry DOI: 10.7270/Q2D21X2G
Sodium-dependent serotonin transporter
(Homo sapiens (Human))
BDBM50136493
(1-Methyl-4,9-dihydro-3H-beta-carboline | 1-methyl-...)
Show SMILES CC1=NCCc2c1[nH]c1ccccc21 |t:1|
Show InChI InChI=1S/C12H12N2/c1-8-12-10(6-7-13-8)9-4-2-3-5-11(9)14-12/h2-5,14H,6-7H2,1H3
>1.00E+4n/an/an/an/an/an/an/an/a
Virginia Commonwealth University
Curated by ChEMBL
Assay Description
Binding affinity towards Serotonin transporter
Bioorg Med Chem Lett 13: 4421-5 (2003)
BindingDB Entry DOI: 10.7270/Q2D21X2G
Sodium-dependent noradrenaline transporter
(Homo sapiens (Human))
BDBM50136493
(1-Methyl-4,9-dihydro-3H-beta-carboline | 1-methyl-...)
Show SMILES CC1=NCCc2c1[nH]c1ccccc21 |t:1|
Show InChI InChI=1S/C12H12N2/c1-8-12-10(6-7-13-8)9-4-2-3-5-11(9)14-12/h2-5,14H,6-7H2,1H3
Reactome pathway
>1.00E+4n/an/an/an/an/an/an/an/a
Virginia Commonwealth University
Curated by ChEMBL
Assay Description
Binding affinity towards NET
Bioorg Med Chem Lett 13: 4421-5 (2003)
BindingDB Entry DOI: 10.7270/Q2D21X2G
5-hydroxytryptamine receptor 1B
(Homo sapiens (Human))
BDBM50136493
(1-Methyl-4,9-dihydro-3H-beta-carboline | 1-methyl-...)
Show SMILES CC1=NCCc2c1[nH]c1ccccc21 |t:1|
Show InChI InChI=1S/C12H12N2/c1-8-12-10(6-7-13-8)9-4-2-3-5-11(9)14-12/h2-5,14H,6-7H2,1H3
Reactome pathway
>1.00E+4n/an/an/an/an/an/an/an/a
Virginia Commonwealth University
Curated by ChEMBL
Assay Description
Binding affinity towards 5-hydroxytryptamine 1B receptor
Bioorg Med Chem Lett 13: 4421-5 (2003)
BindingDB Entry DOI: 10.7270/Q2D21X2G