BDBM50136511 CHEMBL3754799
SMILES: CC(C)Nc1cc(cc(C)n1)-c1nnc(s1)-c1cc(F)c(O[C@@H]2CNC(=O)C2)cc1Cl
InChI Key: InChIKey=VSOIZIDEMKQTBD-ZDUSSCGKSA-N
Data: 1 EC50
Activity Spreadsheet -- Enzyme Inhibition Constant Data from BindingDB
Found 1 hit for monomerid = 50136511
Trg + Lig
Ki
nM
ΔG°
kcal/mole
IC50
nM
Kd
nM
EC50/IC50
nM
koff
s-1
kon
M-1s-1
pHTemp
°C
Sphingosine 1-phosphate receptor 1
(Homo sapiens (Human))
BDBM50136511
(CHEMBL3754799)
Show SMILES CC(C)Nc1cc(cc(C)n1)-c1nnc(s1)-c1cc(F)c(O[C@@H]2CNC(=O)C2)cc1Cl |r|
Show InChI InChI=1S/C21H21ClFN5O2S/c1-10(2)25-18-5-12(4-11(3)26-18)20-27-28-21(31-20)14-7-16(23)17(8-15(14)22)30-13-6-19(29)24-9-13/h4-5,7-8,10,13H,6,9H2,1-3H3,(H,24,29)(H,25,26)/t13-/m0/s1
Reactome pathway
n/an/an/an/a 560n/an/an/an/a
Boehringer Ingelheim Pharmaceuticals
Curated by ChEMBL
Assay Description
Agonist activity at human S1P1 receptor expressed in EDG1-bla U2OS cells incubated for 18 hrs prior to GenBlazer substrate addition by beta-arrestin ...
Bioorg Med Chem Lett 26: 466-71 (2016)
BindingDB Entry DOI: 10.7270/Q2GX4DD4