BDBM50136544 CHEMBL3754355
SMILES: CC(C)Nc1cc(cc(C)n1)-c1nc(no1)-c1cc(C)c(OC[C@H]2COC(=O)N2)cn1
InChI Key: InChIKey=ZZOSCJLIYXGLDK-HNNXBMFYSA-N
Data: 1 EC50
Activity Spreadsheet -- Enzyme Inhibition Constant Data from BindingDB
Found 1 hit for monomerid = 50136544
Trg + Lig
Ki
nM
ΔG°
kcal/mole
IC50
nM
Kd
nM
EC50/IC50
nM
koff
s-1
kon
M-1s-1
pHTemp
°C
Sphingosine 1-phosphate receptor 1
(Homo sapiens (Human))
BDBM50136544
(CHEMBL3754355)
Show SMILES CC(C)Nc1cc(cc(C)n1)-c1nc(no1)-c1cc(C)c(OC[C@H]2COC(=O)N2)cn1 |r|
Show InChI InChI=1S/C21H24N6O4/c1-11(2)23-18-7-14(6-13(4)24-18)20-26-19(27-31-20)16-5-12(3)17(8-22-16)29-9-15-10-30-21(28)25-15/h5-8,11,15H,9-10H2,1-4H3,(H,23,24)(H,25,28)/t15-/m0/s1
Reactome pathway
n/an/an/an/a 18n/an/an/an/a
Boehringer Ingelheim Pharmaceuticals
Curated by ChEMBL
Assay Description
Agonist activity at human S1P1 receptor expressed in EDG1-bla U2OS cells incubated for 18 hrs prior to GenBlazer substrate addition by beta-arrestin ...
Bioorg Med Chem Lett 26: 466-71 (2016)
BindingDB Entry DOI: 10.7270/Q2GX4DD4