BDBM50136695 (S)-1-(6,7-Dimethoxy-3,4-dihydro-1H-isoquinolin-2-yl)-3,3-dimethyl-2-[(pyridin-2-ylmethyl)-amino]-butan-1-one::(S)-1-(6,7-dimethoxy-3,4-dihydroisoquinolin-2(1H)-yl)-3,3-dimethyl-2-(pyridin-2-ylmethylamino)butan-1-one::CHEMBL337159
SMILES: COc1cc2CCN(Cc2cc1OC)C(=O)[C@@H](NCc1ccccn1)C(C)(C)C
InChI Key: InChIKey=SWNBSXQBPQACGE-OAQYLSRUSA-N
Data: 4 IC50
Activity Spreadsheet -- Enzyme Inhibition Constant Data from BindingDB
Found 4 hits for monomerid = 50136695
Trg + Lig
Ki
nM
ΔG°
kcal/mole
IC50
nM
Kd
nM
EC50/IC50
nM
koff
s-1
kon
M-1s-1
pHTemp
°C
Orexin receptor type 1
(Homo sapiens (Human))
BDBM50136695
((S)-1-(6,7-Dimethoxy-3,4-dihydro-1H-isoquinolin-2-...)
Show SMILES COc1cc2CCN(Cc2cc1OC)C(=O)[C@@H](NCc1ccccn1)C(C)(C)C |r|
Show InChI InChI=1S/C23H31N3O3/c1-23(2,3)21(25-14-18-8-6-7-10-24-18)22(27)26-11-9-16-12-19(28-4)20(29-5)13-17(16)15-26/h6-8,10,12-13,21,25H,9,11,14-15H2,1-5H3/t21-/m1/s1
Reactome pathway
n/an/a>1.00E+4n/an/an/an/an/an/a
Banyu Tsukuba Research Institute
Curated by ChEMBL
Assay Description
Inhibitory concentration against human orexin-1 receptor (hOX1R)
Bioorg Med Chem Lett 13: 4497-9 (2003)
BindingDB Entry DOI: 10.7270/Q20R9NT7
Orexin receptor type 2
(Homo sapiens (Human))
BDBM50136695
((S)-1-(6,7-Dimethoxy-3,4-dihydro-1H-isoquinolin-2-...)
Show SMILES COc1cc2CCN(Cc2cc1OC)C(=O)[C@@H](NCc1ccccn1)C(C)(C)C |r|
Show InChI InChI=1S/C23H31N3O3/c1-23(2,3)21(25-14-18-8-6-7-10-24-18)22(27)26-11-9-16-12-19(28-4)20(29-5)13-17(16)15-26/h6-8,10,12-13,21,25H,9,11,14-15H2,1-5H3/t21-/m1/s1
Reactome pathway
n/an/a 1.40E+3n/an/an/an/an/an/a
Actelion Pharmaceuticals Ltd.
Curated by ChEMBL
Assay Description
Antagonist activity at human OX2 receptor
J Med Chem 52: 891-903 (2009)
Article DOI: 10.1021/jm801296d
BindingDB Entry DOI: 10.7270/Q2TM7B3D
Orexin receptor type 1
(Homo sapiens (Human))
BDBM50136695
((S)-1-(6,7-Dimethoxy-3,4-dihydro-1H-isoquinolin-2-...)
Show SMILES COc1cc2CCN(Cc2cc1OC)C(=O)[C@@H](NCc1ccccn1)C(C)(C)C |r|
Show InChI InChI=1S/C23H31N3O3/c1-23(2,3)21(25-14-18-8-6-7-10-24-18)22(27)26-11-9-16-12-19(28-4)20(29-5)13-17(16)15-26/h6-8,10,12-13,21,25H,9,11,14-15H2,1-5H3/t21-/m1/s1
Reactome pathway
n/an/a>1.00E+4n/an/an/an/an/an/a
Actelion Pharmaceuticals Ltd.
Curated by ChEMBL
Assay Description
Antagonist activity at human OX1 receptor
J Med Chem 52: 891-903 (2009)
Article DOI: 10.1021/jm801296d
BindingDB Entry DOI: 10.7270/Q2TM7B3D
Orexin receptor type 2
(Homo sapiens (Human))
BDBM50136695
((S)-1-(6,7-Dimethoxy-3,4-dihydro-1H-isoquinolin-2-...)
Show SMILES COc1cc2CCN(Cc2cc1OC)C(=O)[C@@H](NCc1ccccn1)C(C)(C)C |r|
Show InChI InChI=1S/C23H31N3O3/c1-23(2,3)21(25-14-18-8-6-7-10-24-18)22(27)26-11-9-16-12-19(28-4)20(29-5)13-17(16)15-26/h6-8,10,12-13,21,25H,9,11,14-15H2,1-5H3/t21-/m1/s1
Reactome pathway
n/an/a 1.40E+3n/an/an/an/an/an/a
Banyu Tsukuba Research Institute
Curated by ChEMBL
Assay Description
Inhibitory concentration against human orexin-2 receptor (hOX2R)
Bioorg Med Chem Lett 13: 4497-9 (2003)
BindingDB Entry DOI: 10.7270/Q20R9NT7