BDBM50136889 CHEMBL152403::N-[3-Chloro-4-(1-o-tolyl-vinyl)-phenyl]-benzene-1,2-diamine
SMILES: Cc1ccccc1C(=C)c1ccc(Nc2ccccc2N)cc1Cl
InChI Key: InChIKey=INHFBGJAGMGYSQ-UHFFFAOYSA-N
Data: 1 IC50
Activity Spreadsheet -- Enzyme Inhibition Constant Data from BindingDB
Found 1 hit for monomerid = 50136889
Trg + Lig
Ki
nM
ΔG°
kcal/mole
IC50
nM
Kd
nM
EC50/IC50
nM
koff
s-1
kon
M-1s-1
pHTemp
°C
Mitogen-activated protein kinase 14
(Homo sapiens (Human))
BDBM50136889
(CHEMBL152403 | N-[3-Chloro-4-(1-o-tolyl-vinyl)-phe...)
Show SMILES Cc1ccccc1C(=C)c1ccc(Nc2ccccc2N)cc1Cl
Show InChI InChI=1S/C21H19ClN2/c1-14-7-3-4-8-17(14)15(2)18-12-11-16(13-19(18)22)24-21-10-6-5-9-20(21)23/h3-13,24H,2,23H2,1H3
NCI pathway
Reactome pathway
n/an/a 1.55E+3n/an/an/an/an/an/a
LEO Pharma
Curated by ChEMBL
Assay Description
In vitro inhibitory activity determined against human mitogen-activated protein kinase p38 alpha
J Med Chem 46: 5651-62 (2003)
Article DOI: 10.1021/jm030851s
BindingDB Entry DOI: 10.7270/Q2B56KFK