BDBM50136895 CHEMBL347770::{4-[(2-Amino-phenyl)-methyl-amino]-2-chloro-phenyl}-o-tolyl-methanone
SMILES: CN(c1ccc(C(=O)c2ccccc2C)c(Cl)c1)c1ccccc1N
InChI Key: InChIKey=GIBQUDGWUOVOMR-UHFFFAOYSA-N
Data: 1 IC50
Activity Spreadsheet -- Enzyme Inhibition Constant Data from BindingDB
Found 1 hit for monomerid = 50136895
Trg + Lig
Ki
nM
ΔG°
kcal/mole
IC50
nM
Kd
nM
EC50/IC50
nM
koff
s-1
kon
M-1s-1
pHTemp
°C
Mitogen-activated protein kinase 14
(Homo sapiens (Human))
BDBM50136895
(CHEMBL347770 | {4-[(2-Amino-phenyl)-methyl-amino]-...)
Show SMILES CN(c1ccc(C(=O)c2ccccc2C)c(Cl)c1)c1ccccc1N
Show InChI InChI=1S/C21H19ClN2O/c1-14-7-3-4-8-16(14)21(25)17-12-11-15(13-18(17)22)24(2)20-10-6-5-9-19(20)23/h3-13H,23H2,1-2H3
NCI pathway
Reactome pathway
n/an/a 101n/an/an/an/an/an/a
LEO Pharma
Curated by ChEMBL
Assay Description
In vitro inhibitory activity determined against human mitogen-activated protein kinase p38 alpha
J Med Chem 46: 5651-62 (2003)
Article DOI: 10.1021/jm030851s
BindingDB Entry DOI: 10.7270/Q2B56KFK