BDBM50137181 (2-Methyl-1H-indol-5-yl)-[2-(4-morpholin-4-ylmethyl-phenyl)-thieno[3,2-b]pyridin-7-yl]-amine::CHEMBL311111
SMILES: Cc1cc2cc(Nc3ccnc4cc(sc34)-c3ccc(CN4CCOCC4)cc3)ccc2[nH]1
InChI Key: InChIKey=NWVUSUJOHOVKNG-UHFFFAOYSA-N
Data: 2 IC50
Activity Spreadsheet -- Enzyme Inhibition Constant Data from BindingDB
Found 2 hits for monomerid = 50137181
Trg + Lig
Ki
nM
ΔG°
kcal/mole
IC50
nM
Kd
nM
EC50/IC50
nM
koff
s-1
kon
M-1s-1
pHTemp
°C
Vascular endothelial growth factor receptor 1
(Homo sapiens (Human))
BDBM50137181
((2-Methyl-1H-indol-5-yl)-[2-(4-morpholin-4-ylmethy...)
Show SMILES Cc1cc2cc(Nc3ccnc4cc(sc34)-c3ccc(CN4CCOCC4)cc3)ccc2[nH]1
Show InChI InChI=1S/C27H26N4OS/c1-18-14-21-15-22(6-7-23(21)29-18)30-24-8-9-28-25-16-26(33-27(24)25)20-4-2-19(3-5-20)17-31-10-12-32-13-11-31/h2-9,14-16,29H,10-13,17H2,1H3,(H,28,30)
n/an/a 5n/an/an/an/an/an/a
Pfizer Global Research and Development
Curated by ChEMBL
Assay Description
Inhibitory activity against Vascular endothelial growth factor receptor
Bioorg Med Chem Lett 14: 21-4 (2003)
BindingDB Entry DOI: 10.7270/Q2FT8KFT
Epidermal growth factor receptor
(Homo sapiens (Human))
BDBM50137181
((2-Methyl-1H-indol-5-yl)-[2-(4-morpholin-4-ylmethy...)
Show SMILES Cc1cc2cc(Nc3ccnc4cc(sc34)-c3ccc(CN4CCOCC4)cc3)ccc2[nH]1
Show InChI InChI=1S/C27H26N4OS/c1-18-14-21-15-22(6-7-23(21)29-18)30-24-8-9-28-25-16-26(33-27(24)25)20-4-2-19(3-5-20)17-31-10-12-32-13-11-31/h2-9,14-16,29H,10-13,17H2,1H3,(H,28,30)
n/an/a 1.25E+3n/an/an/an/an/an/a
Pfizer Global Research and Development
Curated by ChEMBL
Assay Description
Inhibitory activity against epidermal growth factor receptor
Bioorg Med Chem Lett 14: 21-4 (2003)
BindingDB Entry DOI: 10.7270/Q2FT8KFT