null
SMILES: CN(CCO)Cc1ccc(cc1)-c1cc2nccc(Nc3ccc4[nH]ccc4c3)c2s1
InChI Key: InChIKey=MVLNKEXGMMGTDC-UHFFFAOYSA-N
Activity Spreadsheet -- Enzyme Inhibition Constant Data from BindingDB
Found 2 hits for monomerid = 50137198
Trg + Lig
Ki
nM
ΔG°
kcal/mole
IC50
nM
Kd
nM
EC50/IC50
nM
koff
s-1
kon
M-1s-1
pHTemp
°C
Epidermal growth factor receptor
(Homo sapiens (Human))
BDBM50137198
(2-({4-[7-(1H-Indol-5-ylamino)-thieno[3,2-b]pyridin...)
Show SMILES CN(CCO)Cc1ccc(cc1)-c1cc2nccc(Nc3ccc4[nH]ccc4c3)c2s1
Show InChI InChI=1S/C25H24N4OS/c1-29(12-13-30)16-17-2-4-18(5-3-17)24-15-23-25(31-24)22(9-11-27-23)28-20-6-7-21-19(14-20)8-10-26-21/h2-11,14-15,26,30H,12-13,16H2,1H3,(H,27,28)
n/an/a 3n/an/an/an/an/an/a
Pfizer Global Research and Development
Curated by ChEMBL
Assay Description
Inhibitory activity against epidermal growth factor receptor
Bioorg Med Chem Lett 14: 21-4 (2003)
BindingDB Entry DOI: 10.7270/Q2FT8KFT
Vascular endothelial growth factor receptor 1
(Homo sapiens (Human))
BDBM50137198
(2-({4-[7-(1H-Indol-5-ylamino)-thieno[3,2-b]pyridin...)
Show SMILES CN(CCO)Cc1ccc(cc1)-c1cc2nccc(Nc3ccc4[nH]ccc4c3)c2s1
Show InChI InChI=1S/C25H24N4OS/c1-29(12-13-30)16-17-2-4-18(5-3-17)24-15-23-25(31-24)22(9-11-27-23)28-20-6-7-21-19(14-20)8-10-26-21/h2-11,14-15,26,30H,12-13,16H2,1H3,(H,27,28)
n/an/a 4n/an/an/an/an/an/a
Pfizer Global Research and Development
Curated by ChEMBL
Assay Description
Inhibitory activity against Vascular endothelial growth factor receptor
Bioorg Med Chem Lett 14: 21-4 (2003)
BindingDB Entry DOI: 10.7270/Q2FT8KFT