BDBM50137203 (1H-Indol-5-yl)-(2-{4-[(2-pyridin-1-yl-ethylamino)-methyl]-phenyl}-thieno[3,2-b]pyridin-7-yl)-amine::CHEMBL80540
SMILES: C(CN1CCNCC1)NCc1ccc(cc1)-c1cc2nccc(Nc3ccc4[nH]ccc4c3)c2s1
InChI Key: InChIKey=CCUYECGXGAFGTM-UHFFFAOYSA-N
Data: 2 IC50
Activity Spreadsheet -- Enzyme Inhibition Constant Data from BindingDB
Found 2 hits for monomerid = 50137203
Trg + Lig
Ki
nM
ΔG°
kcal/mole
IC50
nM
Kd
nM
EC50/IC50
nM
koff
s-1
kon
M-1s-1
pHTemp
°C
Vascular endothelial growth factor receptor 1
(Homo sapiens (Human))
BDBM50137203
((1H-Indol-5-yl)-(2-{4-[(2-pyridin-1-yl-ethylamino)...)
Show SMILES C(CN1CCNCC1)NCc1ccc(cc1)-c1cc2nccc(Nc3ccc4[nH]ccc4c3)c2s1
Show InChI InChI=1S/C28H30N6S/c1-3-21(4-2-20(1)19-30-13-16-34-14-11-29-12-15-34)27-18-26-28(35-27)25(8-10-32-26)33-23-5-6-24-22(17-23)7-9-31-24/h1-10,17-18,29-31H,11-16,19H2,(H,32,33)
n/an/a 7n/an/an/an/an/an/a
Pfizer Global Research and Development
Curated by ChEMBL
Assay Description
Inhibitory activity against Vascular endothelial growth factor receptor
Bioorg Med Chem Lett 14: 21-4 (2003)
BindingDB Entry DOI: 10.7270/Q2FT8KFT
Epidermal growth factor receptor
(Homo sapiens (Human))
BDBM50137203
((1H-Indol-5-yl)-(2-{4-[(2-pyridin-1-yl-ethylamino)...)
Show SMILES C(CN1CCNCC1)NCc1ccc(cc1)-c1cc2nccc(Nc3ccc4[nH]ccc4c3)c2s1
Show InChI InChI=1S/C28H30N6S/c1-3-21(4-2-20(1)19-30-13-16-34-14-11-29-12-15-34)27-18-26-28(35-27)25(8-10-32-26)33-23-5-6-24-22(17-23)7-9-31-24/h1-10,17-18,29-31H,11-16,19H2,(H,32,33)
n/an/a 3n/an/an/an/an/an/a
Pfizer Global Research and Development
Curated by ChEMBL
Assay Description
Inhibitory activity against epidermal growth factor receptor
Bioorg Med Chem Lett 14: 21-4 (2003)
BindingDB Entry DOI: 10.7270/Q2FT8KFT