null
SMILES: COc1ccc(-c2cc(nn2-c2ccc(cn2)S(C)(=O)=O)C(F)(F)F)c(F)c1
InChI Key: InChIKey=CKDCLWJCMBALQZ-UHFFFAOYSA-N
Activity Spreadsheet -- Enzyme Inhibition Constant Data from BindingDB
Found 2 hits for monomerid = 50137439
Trg + Lig
Ki
nM
ΔG°
kcal/mole
IC50
nM
Kd
nM
EC50/IC50
nM
koff
s-1
kon
M-1s-1
pHTemp
°C
Prostaglandin G/H synthase 2
(Canis familiaris)
BDBM50137439
(2-[5-(2-Fluoro-4-methoxy-phenyl)-3-trifluoromethyl...)
Show SMILES COc1ccc(-c2cc(nn2-c2ccc(cn2)S(C)(=O)=O)C(F)(F)F)c(F)c1
Show InChI InChI=1S/C17H13F4N3O3S/c1-27-10-3-5-12(13(18)7-10)14-8-15(17(19,20)21)23-24(14)16-6-4-11(9-22-16)28(2,25)26/h3-9H,1-2H3
Reactome pathway
n/an/a 60n/an/an/an/an/an/a
Pfizer Inc.
Curated by ChEMBL
Assay Description
In vitro inhibitory activity against cannine prostaglandin G/H synthase 2.
Bioorg Med Chem Lett 14: 95-8 (2003)
BindingDB Entry DOI: 10.7270/Q25B01WP
Prostaglandin G/H synthase 1
(Canis familiaris)
BDBM50137439
(2-[5-(2-Fluoro-4-methoxy-phenyl)-3-trifluoromethyl...)
Show SMILES COc1ccc(-c2cc(nn2-c2ccc(cn2)S(C)(=O)=O)C(F)(F)F)c(F)c1
Show InChI InChI=1S/C17H13F4N3O3S/c1-27-10-3-5-12(13(18)7-10)14-8-15(17(19,20)21)23-24(14)16-6-4-11(9-22-16)28(2,25)26/h3-9H,1-2H3
Reactome pathway
n/an/a 2.80E+3n/an/an/an/an/an/a
Pfizer Inc.
Curated by ChEMBL
Assay Description
In vitro inhibitory activity against cannine prostaglandin G/H synthase 1.
Bioorg Med Chem Lett 14: 95-8 (2003)
BindingDB Entry DOI: 10.7270/Q25B01WP