BDBM50137480 1-Cyclohexyl-2-pyridin-2-yl-1H-benzoimidazole-5-carboxylic acid::1-cyclohexyl-2-(pyridin-2-yl)-1H-benzo[d]imidazole-5-carboxylic acid::CHEMBL174683
SMILES: OC(=O)c1ccc2n(C3CCCCC3)c(nc2c1)-c1ccccn1
InChI Key: InChIKey=VJHUUUYKIKSXKH-UHFFFAOYSA-N
Data: 5 IC50
Activity Spreadsheet -- Enzyme Inhibition Constant Data from BindingDB
Found 5 hits for monomerid = 50137480
Trg + Lig
Ki
nM
ΔG°
kcal/mole
IC50
nM
Kd
nM
EC50/IC50
nM
koff
s-1
kon
M-1s-1
pHTemp
°C
Hepatitis C virus NS5B RNA-dependent RNA polymerase
(Hepatitis C virus)
BDBM50137480
(1-Cyclohexyl-2-pyridin-2-yl-1H-benzoimidazole-5-ca...)
Show SMILES OC(=O)c1ccc2n(C3CCCCC3)c(nc2c1)-c1ccccn1
Show InChI InChI=1S/C19H19N3O2/c23-19(24)13-9-10-17-16(12-13)21-18(15-8-4-5-11-20-15)22(17)14-6-2-1-3-7-14/h4-5,8-12,14H,1-3,6-7H2,(H,23,24)
n/an/a 4.30E+3n/an/an/an/an/an/a
Boehringer Ingelheim (Canada) Ltd
Curated by ChEMBL
Assay Description
Inhibitory activity against NS5B polymerase of hepatitis C virus
Bioorg Med Chem Lett 14: 119-24 (2003)
BindingDB Entry DOI: 10.7270/Q21J9968
Poliovirus type 1 polyprotein
(Poliovirus type 1 (strain Mahoney))
BDBM50137480
(1-Cyclohexyl-2-pyridin-2-yl-1H-benzoimidazole-5-ca...)
Show SMILES OC(=O)c1ccc2n(C3CCCCC3)c(nc2c1)-c1ccccn1
Show InChI InChI=1S/C19H19N3O2/c23-19(24)13-9-10-17-16(12-13)21-18(15-8-4-5-11-20-15)22(17)14-6-2-1-3-7-14/h4-5,8-12,14H,1-3,6-7H2,(H,23,24)
n/an/a>5.00E+5n/an/an/an/an/an/a
Boehringer Ingelheim (Canada) Ltd
Curated by ChEMBL
Assay Description
Inhibitory activity against polio virus RNA polymerase
Bioorg Med Chem Lett 14: 119-24 (2003)
BindingDB Entry DOI: 10.7270/Q21J9968
RNA polymerase subunit beta (β-RNAP)
(Escherichia coli)
BDBM50137480
(1-Cyclohexyl-2-pyridin-2-yl-1H-benzoimidazole-5-ca...)
Show SMILES OC(=O)c1ccc2n(C3CCCCC3)c(nc2c1)-c1ccccn1
Show InChI InChI=1S/C19H19N3O2/c23-19(24)13-9-10-17-16(12-13)21-18(15-8-4-5-11-20-15)22(17)14-6-2-1-3-7-14/h4-5,8-12,14H,1-3,6-7H2,(H,23,24)
n/an/a>5.00E+5n/an/an/an/an/an/a
Boehringer Ingelheim (Canada) Ltd
Curated by ChEMBL
Assay Description
Inhibitory activity against calf thymus RNA polymerase
Bioorg Med Chem Lett 14: 119-24 (2003)
BindingDB Entry DOI: 10.7270/Q21J9968
Hepatitis C virus NS5B RNA-dependent RNA polymerase
(Hepatitis C virus)
BDBM50137480
(1-Cyclohexyl-2-pyridin-2-yl-1H-benzoimidazole-5-ca...)
Show SMILES OC(=O)c1ccc2n(C3CCCCC3)c(nc2c1)-c1ccccn1
Show InChI InChI=1S/C19H19N3O2/c23-19(24)13-9-10-17-16(12-13)21-18(15-8-4-5-11-20-15)22(17)14-6-2-1-3-7-14/h4-5,8-12,14H,1-3,6-7H2,(H,23,24)
n/an/a 2.70E+3n/an/an/an/an/an/a
Boehringer Ingelheim
Curated by ChEMBL
Assay Description
Inhibition of HCV 1b NS5B delta21 RNA dependent RNA polymerase by SPA
Bioorg Med Chem Lett 16: 4987-93 (2006)
Checked by Author
Article DOI: 10.1016/j.bmcl.2006.07.074
BindingDB Entry DOI: 10.7270/Q27S7PJT
Genome polyprotein
(Hepatitis C virus (HCV))
BDBM50137480
(1-Cyclohexyl-2-pyridin-2-yl-1H-benzoimidazole-5-ca...)
Show SMILES OC(=O)c1ccc2n(C3CCCCC3)c(nc2c1)-c1ccccn1
Show InChI InChI=1S/C19H19N3O2/c23-19(24)13-9-10-17-16(12-13)21-18(15-8-4-5-11-20-15)22(17)14-6-2-1-3-7-14/h4-5,8-12,14H,1-3,6-7H2,(H,23,24)
n/an/a 4.30E+3n/an/an/an/an/an/a
University of Wollongong
Curated by ChEMBL
Assay Description
Inhibitory concentration against hepatitis C virus polymerase
J Med Chem 48: 1-20 (2005)
Article DOI: 10.1021/jm0400101
BindingDB Entry DOI: 10.7270/Q2XP75Q1