BDBM50137540 2-Chloro-6-fluoro-N-[3-(1-methyl-piperidin-4-yl)-furo[3,2-b]pyridin-5-yl]-benzamide::CHEMBL369705
SMILES: CN1CCC(CC1)c1coc2ccc(NC(=O)c3c(F)cccc3Cl)nc12
InChI Key: InChIKey=SLHURYLZMBDSBK-UHFFFAOYSA-N
Data: 1 KI  1 EC50
Activity Spreadsheet -- Enzyme Inhibition Constant Data from BindingDB
Found 2 hits for monomerid = 50137540
Trg + Lig
Ki
nM
ΔG°
kcal/mole
IC50
nM
Kd
nM
EC50/IC50
nM
koff
s-1
kon
M-1s-1
pHTemp
°C
Serotonin (5-HT) receptor
(Homo sapiens (Human))
BDBM50137540
(2-Chloro-6-fluoro-N-[3-(1-methyl-piperidin-4-yl)-f...)
Show SMILES CN1CCC(CC1)c1coc2ccc(NC(=O)c3c(F)cccc3Cl)nc12
Show InChI InChI=1S/C20H19ClFN3O2/c1-25-9-7-12(8-10-25)13-11-27-16-5-6-17(23-19(13)16)24-20(26)18-14(21)3-2-4-15(18)22/h2-6,11-12H,7-10H2,1H3,(H,23,24,26)
Reactome pathway
2.90n/an/an/an/an/an/an/an/a
Lilly Research Laboratories
Curated by ChEMBL
Assay Description
In vitro binding affinity of the compound for human 5-hydroxytryptamine 1F receptor
Bioorg Med Chem Lett 14: 167-70 (2003)
BindingDB Entry DOI: 10.7270/Q2S46RCF
Serotonin (5-HT) receptor
(Homo sapiens (Human))
BDBM50137540
(2-Chloro-6-fluoro-N-[3-(1-methyl-piperidin-4-yl)-f...)
Show SMILES CN1CCC(CC1)c1coc2ccc(NC(=O)c3c(F)cccc3Cl)nc12
Show InChI InChI=1S/C20H19ClFN3O2/c1-25-9-7-12(8-10-25)13-11-27-16-5-6-17(23-19(13)16)24-20(26)18-14(21)3-2-4-15(18)22/h2-6,11-12H,7-10H2,1H3,(H,23,24,26)
Reactome pathway
n/an/an/an/a 69n/an/an/an/a
Lilly Research Laboratories
Curated by ChEMBL
Assay Description
Concentration required for stimulation of [35S]-GTP-gammaS, binding in mouse LM(tk-1) cells expressing the human 5-hydroxytryptamine 1F receptor
Bioorg Med Chem Lett 14: 167-70 (2003)
BindingDB Entry DOI: 10.7270/Q2S46RCF