BDBM50137595 3-[1-[3-(3-Dimethylamino-propyl)-4,5,6,7-tetrahydro-1H-indol-2-yl]-meth-(Z)-ylidene]-5-methanesulfonyl-1,3-dihydro-indol-2-one::CHEMBL59487
SMILES: CN(C)CCCc1c(\C=C2/C(=O)Nc3ccc(cc23)S(C)(=O)=O)[nH]c2CCCCc12
InChI Key: InChIKey=JOOIDGJYVPQQHV-RGEXLXHISA-N
Data: 1 IC50
Activity Spreadsheet -- Enzyme Inhibition Constant Data from BindingDB
Found 1 hit for monomerid = 50137595
Trg + Lig
Ki
nM
ΔG°
kcal/mole
IC50
nM
Kd
nM
EC50/IC50
nM
koff
s-1
kon
M-1s-1
pHTemp
°C
Proto-oncogene tyrosine-protein kinase Src
(Homo sapiens (Human))
BDBM50137595
(3-[1-[3-(3-Dimethylamino-propyl)-4,5,6,7-tetrahydr...)
Show SMILES CN(C)CCCc1c(\C=C2/C(=O)Nc3ccc(cc23)S(C)(=O)=O)[nH]c2CCCCc12
Show InChI InChI=1S/C23H29N3O3S/c1-26(2)12-6-8-17-16-7-4-5-9-20(16)24-22(17)14-19-18-13-15(30(3,28)29)10-11-21(18)25-23(19)27/h10-11,13-14,24H,4-9,12H2,1-3H3,(H,25,27)/b19-14-
n/an/a 300n/an/an/an/an/an/a
SUGEN, Inc.
Curated by ChEMBL
Assay Description
Inhibitory activity against Src protein tryrosine kinase
Bioorg Med Chem Lett 14: 187-90 (2003)
BindingDB Entry DOI: 10.7270/Q2HM57VG