BDBM50137892 (4-Benzylamino-benzenesulfonyl)-acetic acid::CHEMBL176394
SMILES: OC(=O)CS(=O)(=O)c1ccc(NCc2ccccc2)cc1
InChI Key: InChIKey=YIIMFUHHFMAKDZ-UHFFFAOYSA-N
Data: 1 IC50
Activity Spreadsheet -- Enzyme Inhibition Constant Data from BindingDB
Found 1 hit for monomerid = 50137892
Trg + Lig
Ki
nM
ΔG°
kcal/mole
IC50
nM
Kd
nM
EC50/IC50
nM
koff
s-1
kon
M-1s-1
pHTemp
°C
Replication protein E1
(Human papillomavirus type 11)
BDBM50137892
((4-Benzylamino-benzenesulfonyl)-acetic acid | CHEM...)
Show SMILES OC(=O)CS(=O)(=O)c1ccc(NCc2ccccc2)cc1
Show InChI InChI=1S/C15H15NO4S/c17-15(18)11-21(19,20)14-8-6-13(7-9-14)16-10-12-4-2-1-3-5-12/h1-9,16H,10-11H2,(H,17,18)
n/an/a 6.90E+4n/an/an/an/an/an/a
Boehringer Ingelheim (Canada) Ltd.
Curated by ChEMBL
Assay Description
Ability to inhibit in vitro ATPase activity of human papillomavirus (HPV6) E1 helicase
J Med Chem 47: 18-21 (2003)
Article DOI: 10.1021/jm034206x
BindingDB Entry DOI: 10.7270/Q23F4P2Q