BDBM50137908 (4-Benzo[1,3]dioxol-5-yl-benzenesulfonyl)-acetic acid::CHEMBL369816
SMILES: OC(=O)CS(=O)(=O)c1ccc(cc1)-c1ccc2OCOc2c1
InChI Key: InChIKey=BTWIKWLZLWUPEG-UHFFFAOYSA-N
Data: 1 IC50
Activity Spreadsheet -- Enzyme Inhibition Constant Data from BindingDB
Found 1 hit for monomerid = 50137908
Trg + Lig
Ki
nM
ΔG°
kcal/mole
IC50
nM
Kd
nM
EC50/IC50
nM
koff
s-1
kon
M-1s-1
pHTemp
°C
Replication protein E1
(Human papillomavirus type 11)
BDBM50137908
((4-Benzo[1,3]dioxol-5-yl-benzenesulfonyl)-acetic a...)
Show SMILES OC(=O)CS(=O)(=O)c1ccc(cc1)-c1ccc2OCOc2c1
Show InChI InChI=1S/C15H12O6S/c16-15(17)8-22(18,19)12-4-1-10(2-5-12)11-3-6-13-14(7-11)21-9-20-13/h1-7H,8-9H2,(H,16,17)
n/an/a 1.30E+3n/an/an/an/an/an/a
Boehringer Ingelheim (Canada) Ltd.
Curated by ChEMBL
Assay Description
Ability to inhibit in vitro ATPase activity of human papillomavirus (HPV6) E1 helicase
J Med Chem 47: 18-21 (2003)
Article DOI: 10.1021/jm034206x
BindingDB Entry DOI: 10.7270/Q23F4P2Q