BDBM50137962 (1R,2S)-1-((3R,5S)-1-((S)-2-((S)-2-acetamido-2-cyclohexylacetamido)-3-methylbutanoyl)-3-(2-phenylquinolin-4-yloxy)pyrrolidine-5-carboxamido)-2-vinylcyclopropanecarboxylic acid::1-{[(R)-(S)-1-[(S)-2-((S)-2-Acetylamino-2-cyclohexyl-acetylamino)-3-methyl-butyryl]-4-((S)-2-phenyl-quinolin-4-yloxy)-pyrrolidine-2-carbonyl]-amino}-2-vinyl-cyclopropanecarboxylic acid::1-{[(R)-(S)-1-[(S)-2-((S)-2-Acetylamino-2-cyclohexyl-acetylamino)-3-methyl-butyryl]-4-(2-phenyl-quinolin-4-yloxy)-pyrrolidine-2-carbonyl]-amino}-2-vinyl-cyclopropanecarboxylic acid::CHEMBL84319
SMILES: CC(C)[C@H](NC(=O)[C@@H](NC(C)=O)C1CCCCC1)C(=O)N1C[C@@H](C[C@H]1C(=O)N[C@@]1(C[C@H]1C=C)C(O)=O)Oc1cc(nc2ccccc12)-c1ccccc1
InChI Key: InChIKey=RIZVGEMZBPEENZ-GTCYTXIXSA-N
Data: 3 IC50
Activity Spreadsheet -- Enzyme Inhibition Constant Data from BindingDB
Found 3 hits for monomerid = 50137962
Trg + Lig
Ki
nM
ΔG°
kcal/mole
IC50
nM
Kd
nM
EC50/IC50
nM
koff
s-1
kon
M-1s-1
pHTemp
°C
Hepatitis C virus serine protease, NS3/NS4A
(Hepatitis C virus)
BDBM50137962
((1R,2S)-1-((3R,5S)-1-((S)-2-((S)-2-acetamido-2-cyc...)
Show SMILES CC(C)[C@H](NC(=O)[C@@H](NC(C)=O)C1CCCCC1)C(=O)N1C[C@@H](C[C@H]1C(=O)N[C@@]1(C[C@H]1C=C)C(O)=O)Oc1cc(nc2ccccc12)-c1ccccc1
Show InChI InChI=1S/C41H49N5O7/c1-5-28-22-41(28,40(51)52)45-37(48)33-20-29(53-34-21-32(26-14-8-6-9-15-26)43-31-19-13-12-18-30(31)34)23-46(33)39(50)35(24(2)3)44-38(49)36(42-25(4)47)27-16-10-7-11-17-27/h5-6,8-9,12-15,18-19,21,24,27-29,33,35-36H,1,7,10-11,16-17,20,22-23H2,2-4H3,(H,42,47)(H,44,49)(H,45,48)(H,51,52)/t28-,29-,33+,35+,36+,41-/m1/s1
n/an/a 13n/an/an/an/an/an/a
Boehringer Ingelheim (Canada) Ltd.
Curated by ChEMBL
Assay Description
Inhibitory activity against hepatitis C virus NS3 protease
J Med Chem 47: 123-32 (2003)
Article DOI: 10.1021/jm0303002
BindingDB Entry DOI: 10.7270/Q2Q52P2S
Cathepsin B
(Homo sapiens (Human))
BDBM50137962
((1R,2S)-1-((3R,5S)-1-((S)-2-((S)-2-acetamido-2-cyc...)
Show SMILES CC(C)[C@H](NC(=O)[C@@H](NC(C)=O)C1CCCCC1)C(=O)N1C[C@@H](C[C@H]1C(=O)N[C@@]1(C[C@H]1C=C)C(O)=O)Oc1cc(nc2ccccc12)-c1ccccc1
Show InChI InChI=1S/C41H49N5O7/c1-5-28-22-41(28,40(51)52)45-37(48)33-20-29(53-34-21-32(26-14-8-6-9-15-26)43-31-19-13-12-18-30(31)34)23-46(33)39(50)35(24(2)3)44-38(49)36(42-25(4)47)27-16-10-7-11-17-27/h5-6,8-9,12-15,18-19,21,24,27-29,33,35-36H,1,7,10-11,16-17,20,22-23H2,2-4H3,(H,42,47)(H,44,49)(H,45,48)(H,51,52)/t28-,29-,33+,35+,36+,41-/m1/s1
Reactome pathway
n/an/a>3.00E+4n/an/an/an/an/an/a
Boehringer Ingelheim (Canada) Ltd.
Curated by ChEMBL
Assay Description
Inhibition of human cathepsin B
J Med Chem 47: 6584-94 (2004)
Article DOI: 10.1021/jm0494523
BindingDB Entry DOI: 10.7270/Q21C1WCS
Leukocyte elastase
(Homo sapiens (Human))
BDBM50137962
((1R,2S)-1-((3R,5S)-1-((S)-2-((S)-2-acetamido-2-cyc...)
Show SMILES CC(C)[C@H](NC(=O)[C@@H](NC(C)=O)C1CCCCC1)C(=O)N1C[C@@H](C[C@H]1C(=O)N[C@@]1(C[C@H]1C=C)C(O)=O)Oc1cc(nc2ccccc12)-c1ccccc1
Show InChI InChI=1S/C41H49N5O7/c1-5-28-22-41(28,40(51)52)45-37(48)33-20-29(53-34-21-32(26-14-8-6-9-15-26)43-31-19-13-12-18-30(31)34)23-46(33)39(50)35(24(2)3)44-38(49)36(42-25(4)47)27-16-10-7-11-17-27/h5-6,8-9,12-15,18-19,21,24,27-29,33,35-36H,1,7,10-11,16-17,20,22-23H2,2-4H3,(H,42,47)(H,44,49)(H,45,48)(H,51,52)/t28-,29-,33+,35+,36+,41-/m1/s1
Reactome pathway
n/an/a>3.00E+4n/an/an/an/an/an/a
Boehringer Ingelheim (Canada) Ltd.
Curated by ChEMBL
Assay Description
Inhibition of human leucocyte elastase
J Med Chem 47: 6584-94 (2004)
Article DOI: 10.1021/jm0494523
BindingDB Entry DOI: 10.7270/Q21C1WCS