BDBM50138046 CHEMBL3752435
SMILES: CC(C)(C)CCC1(CCC1)[C@H](O)\C=C\[C@H]1COC(=O)N1CCSc1nc(cs1)C(O)=O
InChI Key: InChIKey=JSUUDWPORGQXHO-QRBHQTINSA-N
Data: 1 KI  3 EC50
Activity Spreadsheet -- Enzyme Inhibition Constant Data from BindingDB
Found 4 hits for monomerid = 50138046
Trg + Lig
Ki
nM
ΔG°
kcal/mole
IC50
nM
Kd
nM
EC50/IC50
nM
koff
s-1
kon
M-1s-1
pHTemp
°C
Prostaglandin E2 receptor EP1 subtype (EP1)
(Homo sapiens (Human))
BDBM50138046
(CHEMBL3752435)
Show SMILES CC(C)(C)CCC1(CCC1)[C@H](O)\C=C\[C@H]1COC(=O)N1CCSc1nc(cs1)C(O)=O |r|
Show InChI InChI=1S/C22H32N2O5S2/c1-21(2,3)9-10-22(7-4-8-22)17(25)6-5-15-13-29-20(28)24(15)11-12-30-19-23-16(14-31-19)18(26)27/h5-6,14-15,17,25H,4,7-13H2,1-3H3,(H,26,27)/b6-5+/t15-,17+/m0/s1
149n/an/an/an/an/an/an/an/a
Ono Pharmaceutical Co., Ltd
Curated by ChEMBL
Assay Description
Binding affinity to human EP1 receptor
Bioorg Med Chem Lett 26: 1016-9 (2016)
BindingDB Entry DOI: 10.7270/Q2JS9S81
Prostaglandin E2 receptor
(Homo sapiens (Human))
BDBM50138046
(CHEMBL3752435)
Show SMILES CC(C)(C)CCC1(CCC1)[C@H](O)\C=C\[C@H]1COC(=O)N1CCSc1nc(cs1)C(O)=O |r|
Show InChI InChI=1S/C22H32N2O5S2/c1-21(2,3)9-10-22(7-4-8-22)17(25)6-5-15-13-29-20(28)24(15)11-12-30-19-23-16(14-31-19)18(26)27/h5-6,14-15,17,25H,4,7-13H2,1-3H3,(H,26,27)/b6-5+/t15-,17+/m0/s1
n/an/an/an/a 6.70n/an/an/an/a
Ono Pharmaceutical Co., Ltd
Curated by ChEMBL
Assay Description
Agonist activity at human EP3 receptor
Bioorg Med Chem Lett 26: 1016-9 (2016)
BindingDB Entry DOI: 10.7270/Q2JS9S81
Prostaglandin E2 receptor EP2 subtype
(Homo sapiens (Human))
BDBM50138046
(CHEMBL3752435)
Show SMILES CC(C)(C)CCC1(CCC1)[C@H](O)\C=C\[C@H]1COC(=O)N1CCSc1nc(cs1)C(O)=O |r|
Show InChI InChI=1S/C22H32N2O5S2/c1-21(2,3)9-10-22(7-4-8-22)17(25)6-5-15-13-29-20(28)24(15)11-12-30-19-23-16(14-31-19)18(26)27/h5-6,14-15,17,25H,4,7-13H2,1-3H3,(H,26,27)/b6-5+/t15-,17+/m0/s1
Reactome pathway
n/an/an/an/a 3.70E+3n/an/an/an/a
Ono Pharmaceutical Co., Ltd
Curated by ChEMBL
Assay Description
Agonist activity at human EP2 receptor
Bioorg Med Chem Lett 26: 1016-9 (2016)
BindingDB Entry DOI: 10.7270/Q2JS9S81
Prostaglandin E2 receptor EP4 subtype
(Homo sapiens (Human))
BDBM50138046
(CHEMBL3752435)
Show SMILES CC(C)(C)CCC1(CCC1)[C@H](O)\C=C\[C@H]1COC(=O)N1CCSc1nc(cs1)C(O)=O |r|
Show InChI InChI=1S/C22H32N2O5S2/c1-21(2,3)9-10-22(7-4-8-22)17(25)6-5-15-13-29-20(28)24(15)11-12-30-19-23-16(14-31-19)18(26)27/h5-6,14-15,17,25H,4,7-13H2,1-3H3,(H,26,27)/b6-5+/t15-,17+/m0/s1
Reactome pathway
n/an/an/an/a 4.71E+3n/an/an/an/a
Ono Pharmaceutical Co., Ltd
Curated by ChEMBL
Assay Description
Agonist activity at human EP4 receptor
Bioorg Med Chem Lett 26: 1016-9 (2016)
BindingDB Entry DOI: 10.7270/Q2JS9S81