BDBM50138050 CHEMBL3752406
SMILES: CC(C)(CCCCF)[C@H](O)\C=C\[C@H]1COC(=O)N1CCSc1nc(cs1)C(O)=O
InChI Key: InChIKey=WYMHORLLZUTSGD-XPKDBEDXSA-N
Data: 1 KI  3 EC50
Activity Spreadsheet -- Enzyme Inhibition Constant Data from BindingDB
Found 4 hits for monomerid = 50138050
Trg + Lig
Ki
nM
ΔG°
kcal/mole
IC50
nM
Kd
nM
EC50/IC50
nM
koff
s-1
kon
M-1s-1
pHTemp
°C
Prostaglandin E2 receptor EP1 subtype (EP1)
(Homo sapiens (Human))
BDBM50138050
(CHEMBL3752406)
Show SMILES CC(C)(CCCCF)[C@H](O)\C=C\[C@H]1COC(=O)N1CCSc1nc(cs1)C(O)=O |r|
Show InChI InChI=1S/C19H27FN2O5S2/c1-19(2,7-3-4-8-20)15(23)6-5-13-11-27-18(26)22(13)9-10-28-17-21-14(12-29-17)16(24)25/h5-6,12-13,15,23H,3-4,7-11H2,1-2H3,(H,24,25)/b6-5+/t13-,15+/m0/s1
431n/an/an/an/an/an/an/an/a
Ono Pharmaceutical Co., Ltd
Curated by ChEMBL
Assay Description
Binding affinity to human EP1 receptor
Bioorg Med Chem Lett 26: 1016-9 (2016)
BindingDB Entry DOI: 10.7270/Q2JS9S81
Prostaglandin E2 receptor
(Homo sapiens (Human))
BDBM50138050
(CHEMBL3752406)
Show SMILES CC(C)(CCCCF)[C@H](O)\C=C\[C@H]1COC(=O)N1CCSc1nc(cs1)C(O)=O |r|
Show InChI InChI=1S/C19H27FN2O5S2/c1-19(2,7-3-4-8-20)15(23)6-5-13-11-27-18(26)22(13)9-10-28-17-21-14(12-29-17)16(24)25/h5-6,12-13,15,23H,3-4,7-11H2,1-2H3,(H,24,25)/b6-5+/t13-,15+/m0/s1
n/an/an/an/a 4.70n/an/an/an/a
Ono Pharmaceutical Co., Ltd
Curated by ChEMBL
Assay Description
Agonist activity at human EP3 receptor
Bioorg Med Chem Lett 26: 1016-9 (2016)
BindingDB Entry DOI: 10.7270/Q2JS9S81
Prostaglandin E2 receptor EP4 subtype
(Homo sapiens (Human))
BDBM50138050
(CHEMBL3752406)
Show SMILES CC(C)(CCCCF)[C@H](O)\C=C\[C@H]1COC(=O)N1CCSc1nc(cs1)C(O)=O |r|
Show InChI InChI=1S/C19H27FN2O5S2/c1-19(2,7-3-4-8-20)15(23)6-5-13-11-27-18(26)22(13)9-10-28-17-21-14(12-29-17)16(24)25/h5-6,12-13,15,23H,3-4,7-11H2,1-2H3,(H,24,25)/b6-5+/t13-,15+/m0/s1
Reactome pathway
n/an/an/an/a 1.22E+3n/an/an/an/a
Ono Pharmaceutical Co., Ltd
Curated by ChEMBL
Assay Description
Agonist activity at human EP4 receptor
Bioorg Med Chem Lett 26: 1016-9 (2016)
BindingDB Entry DOI: 10.7270/Q2JS9S81
Prostaglandin E2 receptor EP2 subtype
(Homo sapiens (Human))
BDBM50138050
(CHEMBL3752406)
Show SMILES CC(C)(CCCCF)[C@H](O)\C=C\[C@H]1COC(=O)N1CCSc1nc(cs1)C(O)=O |r|
Show InChI InChI=1S/C19H27FN2O5S2/c1-19(2,7-3-4-8-20)15(23)6-5-13-11-27-18(26)22(13)9-10-28-17-21-14(12-29-17)16(24)25/h5-6,12-13,15,23H,3-4,7-11H2,1-2H3,(H,24,25)/b6-5+/t13-,15+/m0/s1
Reactome pathway
n/an/an/an/a 5.70n/an/an/an/a
Ono Pharmaceutical Co., Ltd
Curated by ChEMBL
Assay Description
Agonist activity at human EP2 receptor
Bioorg Med Chem Lett 26: 1016-9 (2016)
BindingDB Entry DOI: 10.7270/Q2JS9S81