BDBM50138055 CHEMBL3753622
SMILES: O[C@H](\C=C\[C@H]1COC(=O)N1CCSc1nc(cs1)C(O)=O)C1(CCc2ccccc2)CCC1
InChI Key: InChIKey=HGTLOKDXNMQMEE-QWCIBIBSSA-N
Data: 1 KI  3 EC50
Activity Spreadsheet -- Enzyme Inhibition Constant Data from BindingDB
Found 4 hits for monomerid = 50138055
Trg + Lig
Ki
nM
ΔG°
kcal/mole
IC50
nM
Kd
nM
EC50/IC50
nM
koff
s-1
kon
M-1s-1
pHTemp
°C
Prostaglandin E2 receptor EP1 subtype (EP1)
(Homo sapiens (Human))
BDBM50138055
(CHEMBL3753622)
Show SMILES O[C@H](\C=C\[C@H]1COC(=O)N1CCSc1nc(cs1)C(O)=O)C1(CCc2ccccc2)CCC1 |r|
Show InChI InChI=1S/C24H28N2O5S2/c27-20(24(10-4-11-24)12-9-17-5-2-1-3-6-17)8-7-18-15-31-23(30)26(18)13-14-32-22-25-19(16-33-22)21(28)29/h1-3,5-8,16,18,20,27H,4,9-15H2,(H,28,29)/b8-7+/t18-,20+/m0/s1
802n/an/an/an/an/an/an/an/a
Ono Pharmaceutical Co., Ltd
Curated by ChEMBL
Assay Description
Binding affinity to human EP1 receptor
Bioorg Med Chem Lett 26: 1016-9 (2016)
BindingDB Entry DOI: 10.7270/Q2JS9S81
Prostaglandin E2 receptor
(Homo sapiens (Human))
BDBM50138055
(CHEMBL3753622)
Show SMILES O[C@H](\C=C\[C@H]1COC(=O)N1CCSc1nc(cs1)C(O)=O)C1(CCc2ccccc2)CCC1 |r|
Show InChI InChI=1S/C24H28N2O5S2/c27-20(24(10-4-11-24)12-9-17-5-2-1-3-6-17)8-7-18-15-31-23(30)26(18)13-14-32-22-25-19(16-33-22)21(28)29/h1-3,5-8,16,18,20,27H,4,9-15H2,(H,28,29)/b8-7+/t18-,20+/m0/s1
n/an/an/an/a 27n/an/an/an/a
Ono Pharmaceutical Co., Ltd
Curated by ChEMBL
Assay Description
Agonist activity at human EP3 receptor
Bioorg Med Chem Lett 26: 1016-9 (2016)
BindingDB Entry DOI: 10.7270/Q2JS9S81
Prostaglandin E2 receptor EP4 subtype
(Homo sapiens (Human))
BDBM50138055
(CHEMBL3753622)
Show SMILES O[C@H](\C=C\[C@H]1COC(=O)N1CCSc1nc(cs1)C(O)=O)C1(CCc2ccccc2)CCC1 |r|
Show InChI InChI=1S/C24H28N2O5S2/c27-20(24(10-4-11-24)12-9-17-5-2-1-3-6-17)8-7-18-15-31-23(30)26(18)13-14-32-22-25-19(16-33-22)21(28)29/h1-3,5-8,16,18,20,27H,4,9-15H2,(H,28,29)/b8-7+/t18-,20+/m0/s1
Reactome pathway
n/an/an/an/a 465n/an/an/an/a
Ono Pharmaceutical Co., Ltd
Curated by ChEMBL
Assay Description
Agonist activity at human EP4 receptor
Bioorg Med Chem Lett 26: 1016-9 (2016)
BindingDB Entry DOI: 10.7270/Q2JS9S81
Prostaglandin E2 receptor EP2 subtype
(Homo sapiens (Human))
BDBM50138055
(CHEMBL3753622)
Show SMILES O[C@H](\C=C\[C@H]1COC(=O)N1CCSc1nc(cs1)C(O)=O)C1(CCc2ccccc2)CCC1 |r|
Show InChI InChI=1S/C24H28N2O5S2/c27-20(24(10-4-11-24)12-9-17-5-2-1-3-6-17)8-7-18-15-31-23(30)26(18)13-14-32-22-25-19(16-33-22)21(28)29/h1-3,5-8,16,18,20,27H,4,9-15H2,(H,28,29)/b8-7+/t18-,20+/m0/s1
Reactome pathway
n/an/an/an/a 160n/an/an/an/a
Ono Pharmaceutical Co., Ltd
Curated by ChEMBL
Assay Description
Agonist activity at human EP2 receptor
Bioorg Med Chem Lett 26: 1016-9 (2016)
BindingDB Entry DOI: 10.7270/Q2JS9S81