BDBM50138123 CHEMBL3753703
SMILES: CC(C)CN1CCC(C1)NC(=O)c1ccc(OC2CCN(CC2)C(C)C)cc1
InChI Key: InChIKey=KXDNVFJLTNVAQD-UHFFFAOYSA-N
Data: 2 KI  1 IC50
Activity Spreadsheet -- Enzyme Inhibition Constant Data from BindingDB
Found 3 hits for monomerid = 50138123
Trg + Lig
Ki
nM
ΔG°
kcal/mole
IC50
nM
Kd
nM
EC50/IC50
nM
koff
s-1
kon
M-1s-1
pHTemp
°C
Histamine H3 receptor
(Homo sapiens (Human))
BDBM50138123
(CHEMBL3753703)
Show SMILES CC(C)CN1CCC(C1)NC(=O)c1ccc(OC2CCN(CC2)C(C)C)cc1
Show InChI InChI=1S/C23H37N3O2/c1-17(2)15-25-12-9-20(16-25)24-23(27)19-5-7-21(8-6-19)28-22-10-13-26(14-11-22)18(3)4/h5-8,17-18,20,22H,9-16H2,1-4H3,(H,24,27)
Reactome pathway
1n/an/an/an/an/an/an/an/a
Suven Life Sciences Ltd
Curated by ChEMBL
Assay Description
Displacement of [3H]R-alpha-methyl histamine from recombinant human H3 receptor
Eur J Med Chem 108: 655-62 (2016)
BindingDB Entry DOI: 10.7270/Q2F191KF
Histamine H3 receptor
(Homo sapiens (Human))
BDBM50138123
(CHEMBL3753703)
Show SMILES CC(C)CN1CCC(C1)NC(=O)c1ccc(OC2CCN(CC2)C(C)C)cc1
Show InChI InChI=1S/C23H37N3O2/c1-17(2)15-25-12-9-20(16-25)24-23(27)19-5-7-21(8-6-19)28-22-10-13-26(14-11-22)18(3)4/h5-8,17-18,20,22H,9-16H2,1-4H3,(H,24,27)
Reactome pathway
1.20n/an/an/an/an/an/an/an/a
Suven Life Sciences Ltd
Curated by ChEMBL
Assay Description
Binding affinity to recombinant human H3 receptor
Eur J Med Chem 108: 655-62 (2016)
BindingDB Entry DOI: 10.7270/Q2F191KF
Histamine H3 receptor
(Homo sapiens (Human))
BDBM50138123
(CHEMBL3753703)
Show SMILES CC(C)CN1CCC(C1)NC(=O)c1ccc(OC2CCN(CC2)C(C)C)cc1
Show InChI InChI=1S/C23H37N3O2/c1-17(2)15-25-12-9-20(16-25)24-23(27)19-5-7-21(8-6-19)28-22-10-13-26(14-11-22)18(3)4/h5-8,17-18,20,22H,9-16H2,1-4H3,(H,24,27)
Reactome pathway
n/an/a 459n/an/an/an/an/an/a
Suven Life Sciences Ltd
Curated by ChEMBL
Assay Description
Antagonist activity at recombinant human H3 receptor expressed on CHO-K1 cells assessed as cAMP level by luciferase gene reporter assay
Eur J Med Chem 108: 655-62 (2016)
BindingDB Entry DOI: 10.7270/Q2F191KF