BDBM50138617 2-{4-[(R)-2-Hydroxy-3-(2-methyl-benzothiazol-5-yloxy)-propyl]-piperazin-1-yl}-N-indan-5-yl-acetamide::CHEMBL154927
SMILES: Cc1nc2cc(OC[C@H](O)CN3CCN(CC(=O)Nc4ccc5CCCc5c4)CC3)ccc2s1
InChI Key: InChIKey=VQGKHFHAOAQAAA-JOCHJYFZSA-N
Data: 1 IC50
Activity Spreadsheet -- Enzyme Inhibition Constant Data from BindingDB
Found 1 hit for monomerid = 50138617
Trg + Lig
Ki
nM
ΔG°
kcal/mole
IC50
nM
Kd
nM
EC50/IC50
nM
koff
s-1
kon
M-1s-1
pHTemp
°C
Palmitoyl-CoA oxidase
(Rattus norvegicus)
BDBM50138617
(2-{4-[(R)-2-Hydroxy-3-(2-methyl-benzothiazol-5-ylo...)
Show SMILES Cc1nc2cc(OC[C@H](O)CN3CCN(CC(=O)Nc4ccc5CCCc5c4)CC3)ccc2s1
Show InChI InChI=1S/C26H32N4O3S/c1-18-27-24-14-23(7-8-25(24)34-18)33-17-22(31)15-29-9-11-30(12-10-29)16-26(32)28-21-6-5-19-3-2-4-20(19)13-21/h5-8,13-14,22,31H,2-4,9-12,15-17H2,1H3,(H,28,32)/t22-/m1/s1
Reactome pathway
n/an/a 190n/an/an/an/an/an/a
CV Therapeutics
Curated by ChEMBL
Assay Description
Inhibitory activity against Palmitoyl-CoA oxidase to inhibit rat heart mitochondrial Palmitoyl-CoA oxidation.
Bioorg Med Chem Lett 14: 549-52 (2003)
BindingDB Entry DOI: 10.7270/Q2GH9HD4