BDBM50138963 6-(3-(4-chlorophenoxy)phenyl)-1-(3-chlorophenyl)-1,6-dihydro-1,3,5-triazine-2,4-diamine::6-[3-(4-Chloro-phenoxy)-phenyl]-1-(3-chloro-phenyl)-1,6-dihydro-[1,3,5]triazine-2,4-diamine::CHEMBL158570
SMILES: NC1=NC(N(C(N)=N1)c1cccc(Cl)c1)c1cccc(Oc2ccc(Cl)cc2)c1
InChI Key: InChIKey=FWBIMLMZISAUKA-UHFFFAOYSA-N
Data: 5 KI  6 IC50
Activity Spreadsheet -- Enzyme Inhibition Constant Data from BindingDB
Found 11 hits for monomerid = 50138963
Trg + Lig
Ki
nM
ΔG°
kcal/mole
IC50
nM
Kd
nM
EC50/IC50
nM
koff
s-1
kon
M-1s-1
pHTemp
°C
Bifunctional dihydrofolate reductase-thymidylate synthase
(Plasmodium falciparum (isolate K1 / Thailand))
BDBM50138963
(6-(3-(4-chlorophenoxy)phenyl)-1-(3-chlorophenyl)-1...)
Show SMILES NC1=NC(N(C(N)=N1)c1cccc(Cl)c1)c1cccc(Oc2ccc(Cl)cc2)c1 |c:6,t:1|
Show InChI InChI=1S/C21H17Cl2N5O/c22-14-7-9-17(10-8-14)29-18-6-1-3-13(11-18)19-26-20(24)27-21(25)28(19)16-5-2-4-15(23)12-16/h1-12,19H,(H4,24,25,26,27)
1.30n/an/an/an/an/an/an/an/a
National Center for Genetic Engineering and Biotechnology
Curated by ChEMBL
Assay Description
Binding affinity towards wild-type dihydrofolate reductase of Plasmodium falciparum.
J Med Chem 47: 673-80 (2004)
Article DOI: 10.1021/jm030165t
BindingDB Entry DOI: 10.7270/Q2ST7P8J
Bifunctional dihydrofolate reductase-thymidylate synthase
(Plasmodium falciparum (isolate K1 / Thailand))
BDBM50138963
(6-(3-(4-chlorophenoxy)phenyl)-1-(3-chlorophenyl)-1...)
Show SMILES NC1=NC(N(C(N)=N1)c1cccc(Cl)c1)c1cccc(Oc2ccc(Cl)cc2)c1 |c:6,t:1|
Show InChI InChI=1S/C21H17Cl2N5O/c22-14-7-9-17(10-8-14)29-18-6-1-3-13(11-18)19-26-20(24)27-21(25)28(19)16-5-2-4-15(23)12-16/h1-12,19H,(H4,24,25,26,27)
1.90n/an/an/an/an/an/an/an/a
National Center for Genetic Engineering and Biotechnology
Curated by ChEMBL
Assay Description
Binding affinity towards mutant dihydrofolate reductase (N51I+C59R+S108N DHFR) of Plasmodium falciparum
J Med Chem 47: 673-80 (2004)
Article DOI: 10.1021/jm030165t
BindingDB Entry DOI: 10.7270/Q2ST7P8J
Bifunctional dihydrofolate reductase-thymidylate synthase
(Plasmodium falciparum (isolate K1 / Thailand))
BDBM50138963
(6-(3-(4-chlorophenoxy)phenyl)-1-(3-chlorophenyl)-1...)
Show SMILES NC1=NC(N(C(N)=N1)c1cccc(Cl)c1)c1cccc(Oc2ccc(Cl)cc2)c1 |c:6,t:1|
Show InChI InChI=1S/C21H17Cl2N5O/c22-14-7-9-17(10-8-14)29-18-6-1-3-13(11-18)19-26-20(24)27-21(25)28(19)16-5-2-4-15(23)12-16/h1-12,19H,(H4,24,25,26,27)
3.5n/an/an/an/an/an/an/an/a
National Center for Genetic Engineering and Biotechnology
Curated by ChEMBL
Assay Description
Binding affinity towards mutant dihydrofolate reductase (A16V+S108T DHFR) of Plasmodium falciparum.
J Med Chem 47: 673-80 (2004)
Article DOI: 10.1021/jm030165t
BindingDB Entry DOI: 10.7270/Q2ST7P8J
Bifunctional dihydrofolate reductase-thymidylate synthase
(Plasmodium falciparum (isolate K1 / Thailand))
BDBM50138963
(6-(3-(4-chlorophenoxy)phenyl)-1-(3-chlorophenyl)-1...)
Show SMILES NC1=NC(N(C(N)=N1)c1cccc(Cl)c1)c1cccc(Oc2ccc(Cl)cc2)c1 |c:6,t:1|
Show InChI InChI=1S/C21H17Cl2N5O/c22-14-7-9-17(10-8-14)29-18-6-1-3-13(11-18)19-26-20(24)27-21(25)28(19)16-5-2-4-15(23)12-16/h1-12,19H,(H4,24,25,26,27)
5.10n/an/an/an/an/an/an/an/a
National Center for Genetic Engineering and Biotechnology
Curated by ChEMBL
Assay Description
Binding affinity towards mutant dihydrofolate reductase (C59R+S108N+I164L DHFR) of Plasmodium falciparum
J Med Chem 47: 673-80 (2004)
Article DOI: 10.1021/jm030165t
BindingDB Entry DOI: 10.7270/Q2ST7P8J
Bifunctional dihydrofolate reductase-thymidylate synthase
(Plasmodium falciparum (isolate K1 / Thailand))
BDBM50138963
(6-(3-(4-chlorophenoxy)phenyl)-1-(3-chlorophenyl)-1...)
Show SMILES NC1=NC(N(C(N)=N1)c1cccc(Cl)c1)c1cccc(Oc2ccc(Cl)cc2)c1 |c:6,t:1|
Show InChI InChI=1S/C21H17Cl2N5O/c22-14-7-9-17(10-8-14)29-18-6-1-3-13(11-18)19-26-20(24)27-21(25)28(19)16-5-2-4-15(23)12-16/h1-12,19H,(H4,24,25,26,27)
8n/an/an/an/an/an/an/an/a
National Center for Genetic Engineering and Biotechnology
Curated by ChEMBL
Assay Description
Binding affinity towards mutant dihydrofolate reductase (N51I+C59R+S108N+I164L DHFR) of Plasmodium falciparum
J Med Chem 47: 673-80 (2004)
Article DOI: 10.1021/jm030165t
BindingDB Entry DOI: 10.7270/Q2ST7P8J
Bifunctional dihydrofolate reductase-thymidylate synthase
(Plasmodium falciparum (isolate K1 / Thailand))
BDBM50138963
(6-(3-(4-chlorophenoxy)phenyl)-1-(3-chlorophenyl)-1...)
Show SMILES NC1=NC(N(C(N)=N1)c1cccc(Cl)c1)c1cccc(Oc2ccc(Cl)cc2)c1 |c:6,t:1|
Show InChI InChI=1S/C21H17Cl2N5O/c22-14-7-9-17(10-8-14)29-18-6-1-3-13(11-18)19-26-20(24)27-21(25)28(19)16-5-2-4-15(23)12-16/h1-12,19H,(H4,24,25,26,27)
n/an/a 3.20E+3n/an/an/an/an/an/a
National Center for Genetic Engineering and Biotechnology
Curated by ChEMBL
Assay Description
In vitro anti-plasmodial activity against Plasmodium falciparum with mutant CN51I+C59R+S108N+I164L (V1/S) dihydrofolate reductase.
J Med Chem 47: 673-80 (2004)
Article DOI: 10.1021/jm030165t
BindingDB Entry DOI: 10.7270/Q2ST7P8J
Bifunctional dihydrofolate reductase-thymidylate synthase
(Plasmodium falciparum (isolate K1 / Thailand))
BDBM50138963
(6-(3-(4-chlorophenoxy)phenyl)-1-(3-chlorophenyl)-1...)
Show SMILES NC1=NC(N(C(N)=N1)c1cccc(Cl)c1)c1cccc(Oc2ccc(Cl)cc2)c1 |c:6,t:1|
Show InChI InChI=1S/C21H17Cl2N5O/c22-14-7-9-17(10-8-14)29-18-6-1-3-13(11-18)19-26-20(24)27-21(25)28(19)16-5-2-4-15(23)12-16/h1-12,19H,(H4,24,25,26,27)
n/an/a 3.90E+3n/an/an/an/an/an/a
National Center for Genetic Engineering and Biotechnology
Curated by ChEMBL
Assay Description
In vitro anti-plasmodial activity against Plasmodium falciparum with wild type dihydrofolate reductase (TM4/8.2).
J Med Chem 47: 673-80 (2004)
Article DOI: 10.1021/jm030165t
BindingDB Entry DOI: 10.7270/Q2ST7P8J
Bifunctional dihydrofolate reductase-thymidylate synthase
(Plasmodium falciparum (isolate K1 / Thailand))
BDBM50138963
(6-(3-(4-chlorophenoxy)phenyl)-1-(3-chlorophenyl)-1...)
Show SMILES NC1=NC(N(C(N)=N1)c1cccc(Cl)c1)c1cccc(Oc2ccc(Cl)cc2)c1 |c:6,t:1|
Show InChI InChI=1S/C21H17Cl2N5O/c22-14-7-9-17(10-8-14)29-18-6-1-3-13(11-18)19-26-20(24)27-21(25)28(19)16-5-2-4-15(23)12-16/h1-12,19H,(H4,24,25,26,27)
n/an/a 2.00E+3n/an/an/an/an/an/a
National Center for Genetic Engineering and Biotechnology
Curated by ChEMBL
Assay Description
In vitro anti-plasmodial activity against Plasmodium falciparum with mutant N51I+C59R+S108N (W2) dihydrofolate reductase.
J Med Chem 47: 673-80 (2004)
Article DOI: 10.1021/jm030165t
BindingDB Entry DOI: 10.7270/Q2ST7P8J
Bifunctional dihydrofolate reductase-thymidylate synthase
(Plasmodium falciparum (isolate K1 / Thailand))
BDBM50138963
(6-(3-(4-chlorophenoxy)phenyl)-1-(3-chlorophenyl)-1...)
Show SMILES NC1=NC(N(C(N)=N1)c1cccc(Cl)c1)c1cccc(Oc2ccc(Cl)cc2)c1 |c:6,t:1|
Show InChI InChI=1S/C21H17Cl2N5O/c22-14-7-9-17(10-8-14)29-18-6-1-3-13(11-18)19-26-20(24)27-21(25)28(19)16-5-2-4-15(23)12-16/h1-12,19H,(H4,24,25,26,27)
n/an/a 3.10E+3n/an/an/an/an/an/a
National Center for Genetic Engineering and Biotechnology
Curated by ChEMBL
Assay Description
In vitro anti-plasmodial activity against Plasmodium falciparum with mutant C59R+S108N+I164L (Csl-2) dihydrofolate reductase.
J Med Chem 47: 673-80 (2004)
Article DOI: 10.1021/jm030165t
BindingDB Entry DOI: 10.7270/Q2ST7P8J
Bifunctional dihydrofolate reductase-thymidylate synthase
(Plasmodium falciparum (isolate K1 / Thailand))
BDBM50138963
(6-(3-(4-chlorophenoxy)phenyl)-1-(3-chlorophenyl)-1...)
Show SMILES NC1=NC(N(C(N)=N1)c1cccc(Cl)c1)c1cccc(Oc2ccc(Cl)cc2)c1 |c:6,t:1|
Show InChI InChI=1S/C21H17Cl2N5O/c22-14-7-9-17(10-8-14)29-18-6-1-3-13(11-18)19-26-20(24)27-21(25)28(19)16-5-2-4-15(23)12-16/h1-12,19H,(H4,24,25,26,27)
n/an/a 390n/an/an/an/an/an/a
National Center for Genetic Engineering and Biotechnology
Curated by ChEMBL
Assay Description
In vitro anti-plasmodial activity against Plasmodium falciparum with mutant A16V+S108T (T9/94RC17) dihydrofolate reductase.
J Med Chem 47: 673-80 (2004)
Article DOI: 10.1021/jm030165t
BindingDB Entry DOI: 10.7270/Q2ST7P8J
Bifunctional dihydrofolate reductase-thymidylate synthase
(Plasmodium falciparum (isolate K1 / Thailand))
BDBM50138963
(6-(3-(4-chlorophenoxy)phenyl)-1-(3-chlorophenyl)-1...)
Show SMILES NC1=NC(N(C(N)=N1)c1cccc(Cl)c1)c1cccc(Oc2ccc(Cl)cc2)c1 |c:6,t:1|
Show InChI InChI=1S/C21H17Cl2N5O/c22-14-7-9-17(10-8-14)29-18-6-1-3-13(11-18)19-26-20(24)27-21(25)28(19)16-5-2-4-15(23)12-16/h1-12,19H,(H4,24,25,26,27)
n/an/a 2.60E+3n/an/an/an/an/an/a
National Center for Genetic Engineering and Biotechnology
Curated by ChEMBL
Assay Description
In vitro anti-plasmodial activity against Plasmodium falciparum with mutant C59R+S108N (K1CB1) dihydrofolate reductase.
J Med Chem 47: 673-80 (2004)
Article DOI: 10.1021/jm030165t
BindingDB Entry DOI: 10.7270/Q2ST7P8J