BDBM50139040 1,2,3,4-Tetrahydro-isoquinoline-3-carboxylic acid {(R)-1-(4-chloro-benzyl)-2-[4-(2-isopropoxy-phenyl)-piperazin-1-yl]-2-oxo-ethyl}-amide::CHEMBL164884
SMILES: CC(C)Oc1ccccc1N1CCN(CC1)C(=O)[C@@H](Cc1ccc(Cl)cc1)NC(=O)[C@H]1Cc2ccccc2CN1
InChI Key: InChIKey=LEVZVXAGXROUGG-VSGBNLITSA-N
Data: 1 KI  1 EC50
Activity Spreadsheet -- Enzyme Inhibition Constant Data from BindingDB
Found 2 hits for monomerid = 50139040
Trg + Lig
Ki
nM
ΔG°
kcal/mole
IC50
nM
Kd
nM
EC50/IC50
nM
koff
s-1
kon
M-1s-1
pHTemp
°C
Melanocortin receptor 4
(Homo sapiens (Human))
BDBM50139040
(1,2,3,4-Tetrahydro-isoquinoline-3-carboxylic acid ...)
Show SMILES CC(C)Oc1ccccc1N1CCN(CC1)C(=O)[C@@H](Cc1ccc(Cl)cc1)NC(=O)[C@H]1Cc2ccccc2CN1
Show InChI InChI=1S/C32H37ClN4O3/c1-22(2)40-30-10-6-5-9-29(30)36-15-17-37(18-16-36)32(39)28(19-23-11-13-26(33)14-12-23)35-31(38)27-20-24-7-3-4-8-25(24)21-34-27/h3-14,22,27-28,34H,15-21H2,1-2H3,(H,35,38)/t27-,28-/m1/s1
460n/an/an/an/an/an/an/an/a
Lilly Research Laboratories
Curated by ChEMBL
Assay Description
Agonistic potency towards human melanocortin 4 receptor, determined by 50% maximum cAMP release
J Med Chem 47: 744-55 (2004)
Article DOI: 10.1021/jm0304109
BindingDB Entry DOI: 10.7270/Q2DJ5F21
Melanocortin receptor 4
(Homo sapiens (Human))
BDBM50139040
(1,2,3,4-Tetrahydro-isoquinoline-3-carboxylic acid ...)
Show SMILES CC(C)Oc1ccccc1N1CCN(CC1)C(=O)[C@@H](Cc1ccc(Cl)cc1)NC(=O)[C@H]1Cc2ccccc2CN1
Show InChI InChI=1S/C32H37ClN4O3/c1-22(2)40-30-10-6-5-9-29(30)36-15-17-37(18-16-36)32(39)28(19-23-11-13-26(33)14-12-23)35-31(38)27-20-24-7-3-4-8-25(24)21-34-27/h3-14,22,27-28,34H,15-21H2,1-2H3,(H,35,38)/t27-,28-/m1/s1
n/an/an/an/a 93n/an/an/an/a
Lilly Research Laboratories
Curated by ChEMBL
Assay Description
Agonistic potency of the compound towards human melanocortin 4 receptor, determined by 50% maximum cAMP release
J Med Chem 47: 744-55 (2004)
Article DOI: 10.1021/jm0304109
BindingDB Entry DOI: 10.7270/Q2DJ5F21