BDBM50139151 CHEMBL3764870
SMILES: Cl.Cl.OC1(CNC1)c1cc(cc(c1)C(F)(F)F)C(=O)N[C@@H]1CCc2ccc(Oc3ccnc4NC(=O)CCc34)cc2C1
InChI Key: InChIKey=ZLLIDYXIKGEGQI-GHVWMZMZSA-N
Data: 3 IC50
Activity Spreadsheet -- Enzyme Inhibition Constant Data from BindingDB
Found 3 hits for monomerid = 50139151
Trg + Lig
Ki
nM
ΔG°
kcal/mole
IC50
nM
Kd
nM
EC50/IC50
nM
koff
s-1
kon
M-1s-1
pHTemp
°C
1,3-beta-glucan synthase component GLS2
(Saccharomyces cerevisiae)
BDBM50139151
(CHEMBL3764870)
Show SMILES Cl.Cl.OC1(CNC1)c1cc(cc(c1)C(F)(F)F)C(=O)N[C@@H]1CCc2ccc(Oc3ccnc4NC(=O)CCc34)cc2C1 |r|
Show InChI InChI=1S/C29H27F3N4O4.2ClH/c30-29(31,32)20-10-18(9-19(13-20)28(39)14-33-15-28)27(38)35-21-3-1-16-2-4-22(12-17(16)11-21)40-24-7-8-34-26-23(24)5-6-25(37)36-26;;/h2,4,7-10,12-13,21,33,39H,1,3,5-6,11,14-15H2,(H,35,38)(H,34,36,37);2*1H/t21-;;/m1../s1
n/an/a 4.90E+3n/an/an/an/an/an/a
Takeda Pharmaceuticals International Co. 40 Landsdowne Street, Cambridge, MA 02139, United States.
Curated by ChEMBL
Assay Description
Inhibition of CDK2/Cyclin E (unknown origin)
Bioorg Med Chem Lett 26: 1156-60 (2016)
BindingDB Entry DOI: 10.7270/Q29P33HD
Serine/threonine-protein kinase B-raf
(Homo sapiens (Human))
BDBM50139151
(CHEMBL3764870)
Show SMILES Cl.Cl.OC1(CNC1)c1cc(cc(c1)C(F)(F)F)C(=O)N[C@@H]1CCc2ccc(Oc3ccnc4NC(=O)CCc34)cc2C1 |r|
Show InChI InChI=1S/C29H27F3N4O4.2ClH/c30-29(31,32)20-10-18(9-19(13-20)28(39)14-33-15-28)27(38)35-21-3-1-16-2-4-22(12-17(16)11-21)40-24-7-8-34-26-23(24)5-6-25(37)36-26;;/h2,4,7-10,12-13,21,33,39H,1,3,5-6,11,14-15H2,(H,35,38)(H,34,36,37);2*1H/t21-;;/m1../s1
NCI pathway
Reactome pathway
n/an/a 854n/an/an/an/an/an/a
Takeda Pharmaceuticals International Co. 40 Landsdowne Street, Cambridge, MA 02139, United States.
Curated by ChEMBL
Assay Description
Inhibition of CDK4/Cyclin D1 (unknown origin) using RPPTLSPIPHIPR peptide as substrate in presence of [gamma-33P]ATP
Bioorg Med Chem Lett 26: 1156-60 (2016)
BindingDB Entry DOI: 10.7270/Q29P33HD
Serine/threonine-protein kinase B-raf
(Homo sapiens (Human))
BDBM50139151
(CHEMBL3764870)
Show SMILES Cl.Cl.OC1(CNC1)c1cc(cc(c1)C(F)(F)F)C(=O)N[C@@H]1CCc2ccc(Oc3ccnc4NC(=O)CCc34)cc2C1 |r|
Show InChI InChI=1S/C29H27F3N4O4.2ClH/c30-29(31,32)20-10-18(9-19(13-20)28(39)14-33-15-28)27(38)35-21-3-1-16-2-4-22(12-17(16)11-21)40-24-7-8-34-26-23(24)5-6-25(37)36-26;;/h2,4,7-10,12-13,21,33,39H,1,3,5-6,11,14-15H2,(H,35,38)(H,34,36,37);2*1H/t21-;;/m1../s1
NCI pathway
Reactome pathway
n/an/a 2.20n/an/an/an/an/an/a
Takeda Pharmaceuticals International Co. 40 Landsdowne Street, Cambridge, MA 02139, United States.
Curated by ChEMBL
Assay Description
Inhibition of CDK2/Cyclin E (unknown origin) expressed in baculoviral infected insect Sf9 cells using histone H1 as substrate in presence of [gamma-3...
Bioorg Med Chem Lett 26: 1156-60 (2016)
BindingDB Entry DOI: 10.7270/Q29P33HD