BDBM50139184 4-(2-cyclohexyl-1-ethynyl)-23-oxo-8-oxa-1,15,17,21-tetraazapentacyclo[19.2.2.13,7.19,13.015,19]heptacosa-3(27),4,6,9(26),10,12,16,18-octaen-10-yl cyanide::CHEMBL158586
SMILES: O=C1CN2CCN1Cc1cc(Oc3cc(Cn4cncc4C2)ccc3C#N)ccc1C#CC1CCCCC1
InChI Key: InChIKey=OFEALQXVDCUNBG-UHFFFAOYSA-N
Data: 3 IC50
Activity Spreadsheet -- Enzyme Inhibition Constant Data from BindingDB
Found 3 hits for monomerid = 50139184
Trg + Lig
Ki
nM
ΔG°
kcal/mole
IC50
nM
Kd
nM
EC50/IC50
nM
koff
s-1
kon
M-1s-1
pHTemp
°C
Geranylgeranyl transferase type I beta subunit/Protein Farnesyltransferase (PFT)
(Homo sapiens (Human))
BDBM50139184
(4-(2-cyclohexyl-1-ethynyl)-23-oxo-8-oxa-1,15,17,21...)
Show SMILES O=C1CN2CCN1Cc1cc(Oc3cc(Cn4cncc4C2)ccc3C#N)ccc1C#CC1CCCCC1
Show InChI InChI=1S/C31H31N5O2/c32-16-26-9-7-24-14-30(26)38-29-11-10-25(8-6-23-4-2-1-3-5-23)27(15-29)19-35-13-12-34(21-31(35)37)20-28-17-33-22-36(28)18-24/h7,9-11,14-15,17,22-23H,1-5,12-13,18-21H2
n/an/a 2.40n/an/an/an/an/an/a
Merck Research Laboratories
Curated by ChEMBL
Assay Description
Inhibition of human Geranylgeranyl transferase type I incorporation of [3H]-GGPP into biotinylated peptide corresponding to the C-terminus of human K...
Bioorg Med Chem Lett 14: 639-43 (2004)
BindingDB Entry DOI: 10.7270/Q2WM1CTK
Protein Farnesyltransferase (PFT)
(Homo sapiens (Human))
BDBM50139184
(4-(2-cyclohexyl-1-ethynyl)-23-oxo-8-oxa-1,15,17,21...)
Show SMILES O=C1CN2CCN1Cc1cc(Oc3cc(Cn4cncc4C2)ccc3C#N)ccc1C#CC1CCCCC1
Show InChI InChI=1S/C31H31N5O2/c32-16-26-9-7-24-14-30(26)38-29-11-10-25(8-6-23-4-2-1-3-5-23)27(15-29)19-35-13-12-34(21-31(35)37)20-28-17-33-22-36(28)18-24/h7,9-11,14-15,17,22-23H,1-5,12-13,18-21H2
Reactome pathway
n/an/a 170n/an/an/an/an/an/a
Merck Research Laboratories
Curated by ChEMBL
Assay Description
Displacement of radiolabeled FTI from Farnesyltransferase in cultured Ha-ras transformed RAT1 cells.
Bioorg Med Chem Lett 14: 639-43 (2004)
BindingDB Entry DOI: 10.7270/Q2WM1CTK
Protein Farnesyltransferase (PFT)
(Homo sapiens (Human))
BDBM50139184
(4-(2-cyclohexyl-1-ethynyl)-23-oxo-8-oxa-1,15,17,21...)
Show SMILES O=C1CN2CCN1Cc1cc(Oc3cc(Cn4cncc4C2)ccc3C#N)ccc1C#CC1CCCCC1
Show InChI InChI=1S/C31H31N5O2/c32-16-26-9-7-24-14-30(26)38-29-11-10-25(8-6-23-4-2-1-3-5-23)27(15-29)19-35-13-12-34(21-31(35)37)20-28-17-33-22-36(28)18-24/h7,9-11,14-15,17,22-23H,1-5,12-13,18-21H2
Reactome pathway
n/an/a 364n/an/an/an/an/an/a
Merck Research Laboratories
Curated by ChEMBL
Assay Description
Inhibition of human Farnesyltransferase -catalyzed incorporation of [3H]-FPP into recombinant Ras-CVIM.
Bioorg Med Chem Lett 14: 639-43 (2004)
BindingDB Entry DOI: 10.7270/Q2WM1CTK