BDBM50139201 CHEMBL350680::methyl 10-cyano-23-oxo-8-oxa-1,15,17,21-tetraazapentacyclo[19.2.2.13,7.19,13.015,19]heptacosa-3(27),4,6,9(26),10,12,16,18-octaene-4-carboxylate
SMILES: COC(=O)c1ccc2Oc3cc(Cn4cncc4CN4CCN(Cc1c2)C(=O)C4)ccc3C#N
InChI Key: InChIKey=SFKOTJCSIYBZQW-UHFFFAOYSA-N
Data: 3 IC50
Activity Spreadsheet -- Enzyme Inhibition Constant Data from BindingDB
Found 3 hits for monomerid = 50139201
Trg + Lig
Ki
nM
ΔG°
kcal/mole
IC50
nM
Kd
nM
EC50/IC50
nM
koff
s-1
kon
M-1s-1
pHTemp
°C
Geranylgeranyl transferase type I beta subunit/Protein Farnesyltransferase (PFT)
(Homo sapiens (Human))
BDBM50139201
(CHEMBL350680 | methyl 10-cyano-23-oxo-8-oxa-1,15,1...)
Show SMILES COC(=O)c1ccc2Oc3cc(Cn4cncc4CN4CCN(Cc1c2)C(=O)C4)ccc3C#N
Show InChI InChI=1S/C25H23N5O4/c1-33-25(32)22-5-4-21-9-19(22)13-29-7-6-28(15-24(29)31)14-20-11-27-16-30(20)12-17-2-3-18(10-26)23(8-17)34-21/h2-5,8-9,11,16H,6-7,12-15H2,1H3
n/an/a 420n/an/an/an/an/an/a
Merck Research Laboratories
Curated by ChEMBL
Assay Description
Inhibition of human Geranylgeranyl transferase type I incorporation of [3H]-GGPP into biotinylated peptide corresponding to the C-terminus of human K...
Bioorg Med Chem Lett 14: 639-43 (2004)
BindingDB Entry DOI: 10.7270/Q2WM1CTK
Protein Farnesyltransferase (PFT)
(Homo sapiens (Human))
BDBM50139201
(CHEMBL350680 | methyl 10-cyano-23-oxo-8-oxa-1,15,1...)
Show SMILES COC(=O)c1ccc2Oc3cc(Cn4cncc4CN4CCN(Cc1c2)C(=O)C4)ccc3C#N
Show InChI InChI=1S/C25H23N5O4/c1-33-25(32)22-5-4-21-9-19(22)13-29-7-6-28(15-24(29)31)14-20-11-27-16-30(20)12-17-2-3-18(10-26)23(8-17)34-21/h2-5,8-9,11,16H,6-7,12-15H2,1H3
Reactome pathway
n/an/a 24n/an/an/an/an/an/a
Merck Research Laboratories
Curated by ChEMBL
Assay Description
Inhibition of human Farnesyltransferase -catalyzed incorporation of [3H]-FPP into recombinant Ras-CVIM.
Bioorg Med Chem Lett 14: 639-43 (2004)
BindingDB Entry DOI: 10.7270/Q2WM1CTK
Protein Farnesyltransferase (PFT)
(Homo sapiens (Human))
BDBM50139201
(CHEMBL350680 | methyl 10-cyano-23-oxo-8-oxa-1,15,1...)
Show SMILES COC(=O)c1ccc2Oc3cc(Cn4cncc4CN4CCN(Cc1c2)C(=O)C4)ccc3C#N
Show InChI InChI=1S/C25H23N5O4/c1-33-25(32)22-5-4-21-9-19(22)13-29-7-6-28(15-24(29)31)14-20-11-27-16-30(20)12-17-2-3-18(10-26)23(8-17)34-21/h2-5,8-9,11,16H,6-7,12-15H2,1H3
Reactome pathway
n/an/a 20n/an/an/an/an/an/a
Merck Research Laboratories
Curated by ChEMBL
Assay Description
Displacement of radiolabeled FTI from Farnesyltransferase in cultured Ha-ras transformed RAT1 cells.
Bioorg Med Chem Lett 14: 639-43 (2004)
BindingDB Entry DOI: 10.7270/Q2WM1CTK