BDBM50139591 4-(5-{[2-(3-Fluoro-phenyl)-3-oxo-2,3,4,5-tetrahydro-1H-benzo[c]azepin-4-ylamino]-methyl}-imidazol-1-ylmethyl)-benzonitrile::CHEMBL166353
SMILES: Fc1cccc(c1)N1Cc2ccccc2CC(NCc2cncn2Cc2ccc(cc2)C#N)C1=O
InChI Key: InChIKey=QKWVXFYKJWTMMF-UHFFFAOYSA-N
Data: 1 IC50
Activity Spreadsheet -- Enzyme Inhibition Constant Data from BindingDB
Found 1 hit for monomerid = 50139591
Trg + Lig
Ki
nM
ΔG°
kcal/mole
IC50
nM
Kd
nM
EC50/IC50
nM
koff
s-1
kon
M-1s-1
pHTemp
°C
Protein Farnesyltransferase (PFT)
(Homo sapiens (Human))
BDBM50139591
(4-(5-{[2-(3-Fluoro-phenyl)-3-oxo-2,3,4,5-tetrahydr...)
Show SMILES Fc1cccc(c1)N1Cc2ccccc2CC(NCc2cncn2Cc2ccc(cc2)C#N)C1=O
Show InChI InChI=1S/C28H24FN5O/c29-24-6-3-7-25(13-24)34-18-23-5-2-1-4-22(23)12-27(28(34)35)32-16-26-15-31-19-33(26)17-21-10-8-20(14-30)9-11-21/h1-11,13,15,19,27,32H,12,16-18H2
Reactome pathway
n/an/a 9n/an/an/an/an/an/a
Institut de Recherches Servier
Curated by ChEMBL
Assay Description
Inhibition of farnesyltransferase
Bioorg Med Chem Lett 14: 767-71 (2004)
BindingDB Entry DOI: 10.7270/Q2348JSW