BDBM50139593 (S)-3-{13-[(2R,5S,1'R,3'R)-5'-((R)-1-Hydroxy-undecyl)-octahydro-[2,2']bifuranyl-5-yl]-tridecyl}-5-methyl-5H-furan-2-one::CHEMBL164819
SMILES: CCCCCCCCCC[C@@H](O)[C@H]1CC[C@@H](O1)[C@H]1CC[C@H](CCCCCCCCCCCCCC2=C[C@H](C)OC2=O)O1
InChI Key: InChIKey=ZTUMLIYWQSQXKN-CXPQHEJVSA-N
Data: 1 IC50
Activity Spreadsheet -- Enzyme Inhibition Constant Data from BindingDB
Found 1 hit for monomerid = 50139593
Trg + Lig
Ki
nM
ΔG°
kcal/mole
IC50
nM
Kd
nM
EC50/IC50
nM
koff
s-1
kon
M-1s-1
pHTemp
°C
Mitochondrial complex I; NADH oxidoreductase
(Bos taurus)
BDBM50139593
((S)-3-{13-[(2R,5S,1'R,3'R)-5'-((R)-1-Hydroxy-undec...)
Show SMILES CCCCCCCCCC[C@@H](O)[C@H]1CC[C@@H](O1)[C@H]1CC[C@H](CCCCCCCCCCCCCC2=C[C@H](C)OC2=O)O1 |t:35|
Show InChI InChI=1S/C37H66O5/c1-3-4-5-6-7-15-18-21-24-33(38)34-27-28-36(42-34)35-26-25-32(41-35)23-20-17-14-12-10-8-9-11-13-16-19-22-31-29-30(2)40-37(31)39/h29-30,32-36,38H,3-28H2,1-2H3/t30-,32-,33+,34+,35+,36+/m0/s1
n/an/a 2.70n/an/an/an/an/an/a
Kyoto University
Curated by ChEMBL
Assay Description
Inhibitory concentration needed to halve the control NADH oxidase activity in bovine heart submitochondrial particles (SMP)
Bioorg Med Chem Lett 14: 779-82 (2004)
BindingDB Entry DOI: 10.7270/Q2ZC8290