BDBM50140269 CHEMBL3752653
SMILES: CCOc1nc(cnc1N)-c1ccc2nc(NC(C)=O)cn2c1
InChI Key: InChIKey=VFOHYUAAFPAAFZ-UHFFFAOYSA-N
Data: 1 IC50  1 EC50
Activity Spreadsheet -- Enzyme Inhibition Constant Data from BindingDB
Found 2 hits for monomerid = 50140269
Trg + Lig
Ki
nM
ΔG°
kcal/mole
IC50
nM
Kd
nM
EC50/IC50
nM
koff
s-1
kon
M-1s-1
pHTemp
°C
Phosphatidylinositol 4,5-bisphosphate 3-kinase catalytic subunit alpha isoform
(Homo sapiens (Human))
BDBM50140269
(CHEMBL3752653)
Show SMILES CCOc1nc(cnc1N)-c1ccc2nc(NC(C)=O)cn2c1
Show InChI InChI=1S/C15H16N6O2/c1-3-23-15-14(16)17-6-11(19-15)10-4-5-13-20-12(18-9(2)22)8-21(13)7-10/h4-8H,3H2,1-2H3,(H2,16,17)(H,18,22)
NCI pathway
Reactome pathway
n/an/a 3n/an/an/an/an/an/a
Novartis Institutes for BioMedical Research
Curated by ChEMBL
Assay Description
Inhibition of PI3Kalpha (unknown origin) using 1 alpha-phosphatidylinositol as substrate assessed as ATP depletion after 5 mins by KinaseGlo assay
Bioorg Med Chem Lett 26: 742-6 (2016)
BindingDB Entry DOI: 10.7270/Q2XP76SB
Phosphatidylinositol 4,5-bisphosphate 3-kinase catalytic subunit alpha isoform
(Homo sapiens (Human))
BDBM50140269
(CHEMBL3752653)
Show SMILES CCOc1nc(cnc1N)-c1ccc2nc(NC(C)=O)cn2c1
Show InChI InChI=1S/C15H16N6O2/c1-3-23-15-14(16)17-6-11(19-15)10-4-5-13-20-12(18-9(2)22)8-21(13)7-10/h4-8H,3H2,1-2H3,(H2,16,17)(H,18,22)
NCI pathway
Reactome pathway
n/an/an/an/a<40n/an/an/an/a
Novartis Institutes for BioMedical Research
Curated by ChEMBL
Assay Description
Inhibition of PI3Kalpha in human A2780 cells assessed as reduction of AKT phosphorylation at Ser473 after 1 hr
Bioorg Med Chem Lett 26: 742-6 (2016)
BindingDB Entry DOI: 10.7270/Q2XP76SB