BDBM50140366 2-(6-Chloro-naphthalen-2-yl)-5-methyl-2H-pyrazole-3-carboxylic acid [5-(2-sulfamoyl-phenyl)-pyridin-2-yl]-amide::CHEMBL277679
SMILES: Cc1cc(C(=O)Nc2ccc(cn2)-c2ccccc2S(N)(=O)=O)n(n1)-c1ccc2cc(Cl)ccc2c1
InChI Key: InChIKey=CPZVHEIHBOXGKU-UHFFFAOYSA-N
Data: 1 KI  1 IC50
Activity Spreadsheet -- Enzyme Inhibition Constant Data from BindingDB
Found 2 hits for monomerid = 50140366
Trg + Lig
Ki
nM
ΔG°
kcal/mole
IC50
nM
Kd
nM
EC50/IC50
nM
koff
s-1
kon
M-1s-1
pHTemp
°C
Coagulation factor X
(Homo sapiens (Human))
BDBM50140366
(2-(6-Chloro-naphthalen-2-yl)-5-methyl-2H-pyrazole-...)
Show SMILES Cc1cc(C(=O)Nc2ccc(cn2)-c2ccccc2S(N)(=O)=O)n(n1)-c1ccc2cc(Cl)ccc2c1
Show InChI InChI=1S/C26H20ClN5O3S/c1-16-12-23(32(31-16)21-10-7-17-13-20(27)9-6-18(17)14-21)26(33)30-25-11-8-19(15-29-25)22-4-2-3-5-24(22)36(28,34)35/h2-15H,1H3,(H2,28,34,35)(H,29,30,33)
Reactome pathway
1.90n/an/an/an/an/an/an/an/a
Millennium Pharmaceuticals Inc.
Curated by ChEMBL
Assay Description
Binding affinity against Coagulation factor X
Bioorg Med Chem Lett 14: 1221-7 (2004)
Article DOI: 10.1016/j.bmcl.2003.12.053
BindingDB Entry DOI: 10.7270/Q2VD6XV5
Coagulation factor X
(Homo sapiens (Human))
BDBM50140366
(2-(6-Chloro-naphthalen-2-yl)-5-methyl-2H-pyrazole-...)
Show SMILES Cc1cc(C(=O)Nc2ccc(cn2)-c2ccccc2S(N)(=O)=O)n(n1)-c1ccc2cc(Cl)ccc2c1
Show InChI InChI=1S/C26H20ClN5O3S/c1-16-12-23(32(31-16)21-10-7-17-13-20(27)9-6-18(17)14-21)26(33)30-25-11-8-19(15-29-25)22-4-2-3-5-24(22)36(28,34)35/h2-15H,1H3,(H2,28,34,35)(H,29,30,33)
Reactome pathway
n/an/a 5n/an/an/an/an/an/a
Millennium Pharmaceuticals Inc.
Curated by ChEMBL
Assay Description
Inhibitory concentration against human Coagulation factor X
Bioorg Med Chem Lett 14: 1221-7 (2004)
Article DOI: 10.1016/j.bmcl.2003.12.053
BindingDB Entry DOI: 10.7270/Q2VD6XV5