BDBM50140375 2-(6-Chloro-naphthalen-2-yl)-5-methyl-2H-pyrazole-3-carboxylic acid (2'-dimethylaminomethyl-biphenyl-4-yl)-amide::CHEMBL20832
SMILES: CN(C)Cc1ccccc1-c1ccc(NC(=O)c2cc(C)nn2-c2ccc3cc(Cl)ccc3c2)cc1
InChI Key: InChIKey=VTIFDOBLLNTLSJ-UHFFFAOYSA-N
Data: 1 KI  1 IC50
Activity Spreadsheet -- Enzyme Inhibition Constant Data from BindingDB
Found 2 hits for monomerid = 50140375
Trg + Lig
Ki
nM
ΔG°
kcal/mole
IC50
nM
Kd
nM
EC50/IC50
nM
koff
s-1
kon
M-1s-1
pHTemp
°C
Coagulation factor X
(Homo sapiens (Human))
BDBM50140375
(2-(6-Chloro-naphthalen-2-yl)-5-methyl-2H-pyrazole-...)
Show SMILES CN(C)Cc1ccccc1-c1ccc(NC(=O)c2cc(C)nn2-c2ccc3cc(Cl)ccc3c2)cc1
Show InChI InChI=1S/C30H27ClN4O/c1-20-16-29(35(33-20)27-15-11-22-17-25(31)12-8-23(22)18-27)30(36)32-26-13-9-21(10-14-26)28-7-5-4-6-24(28)19-34(2)3/h4-18H,19H2,1-3H3,(H,32,36)
Reactome pathway
1.80n/an/an/an/an/an/an/an/a
Millennium Pharmaceuticals Inc.
Curated by ChEMBL
Assay Description
Binding affinity against Coagulation factor X
Bioorg Med Chem Lett 14: 1221-7 (2004)
Article DOI: 10.1016/j.bmcl.2003.12.053
BindingDB Entry DOI: 10.7270/Q2VD6XV5
Coagulation factor X
(Homo sapiens (Human))
BDBM50140375
(2-(6-Chloro-naphthalen-2-yl)-5-methyl-2H-pyrazole-...)
Show SMILES CN(C)Cc1ccccc1-c1ccc(NC(=O)c2cc(C)nn2-c2ccc3cc(Cl)ccc3c2)cc1
Show InChI InChI=1S/C30H27ClN4O/c1-20-16-29(35(33-20)27-15-11-22-17-25(31)12-8-23(22)18-27)30(36)32-26-13-9-21(10-14-26)28-7-5-4-6-24(28)19-34(2)3/h4-18H,19H2,1-3H3,(H,32,36)
Reactome pathway
n/an/a 5n/an/an/an/an/an/a
Millennium Pharmaceuticals Inc.
Curated by ChEMBL
Assay Description
Inhibitory concentration against human Coagulation factor X
Bioorg Med Chem Lett 14: 1221-7 (2004)
Article DOI: 10.1016/j.bmcl.2003.12.053
BindingDB Entry DOI: 10.7270/Q2VD6XV5