BDBM50140437 2-(6-Chloro-naphthalen-2-yl)-5-trifluoromethyl-2H-pyrazole-3-carboxylic acid [2-fluoro-4-(imino-piperidin-1-yl-methyl)-phenyl]-amide::CHEMBL277657
SMILES: Fc1cc(ccc1NC(=O)c1cc(nn1-c1ccc2cc(Cl)ccc2c1)C(F)(F)F)C(=N)N1CCCCC1
InChI Key: InChIKey=NVYFNGPVAWIIAH-UHFFFAOYSA-N
Data: 1 IC50
Activity Spreadsheet -- Enzyme Inhibition Constant Data from BindingDB
Found 1 hit for monomerid = 50140437
Trg + Lig
Ki
nM
ΔG°
kcal/mole
IC50
nM
Kd
nM
EC50/IC50
nM
koff
s-1
kon
M-1s-1
pHTemp
°C
Coagulation factor X
(Homo sapiens (Human))
BDBM50140437
(2-(6-Chloro-naphthalen-2-yl)-5-trifluoromethyl-2H-...)
Show SMILES Fc1cc(ccc1NC(=O)c1cc(nn1-c1ccc2cc(Cl)ccc2c1)C(F)(F)F)C(=N)N1CCCCC1
Show InChI InChI=1S/C27H22ClF4N5O/c28-19-7-4-17-13-20(8-5-16(17)12-19)37-23(15-24(35-37)27(30,31)32)26(38)34-22-9-6-18(14-21(22)29)25(33)36-10-2-1-3-11-36/h4-9,12-15,33H,1-3,10-11H2,(H,34,38)
Reactome pathway
n/an/a 4n/an/an/an/an/an/a
Millennium Pharmaceuticals Inc.
Curated by ChEMBL
Assay Description
In vitro inhibitory activity against human coagulation factor X
Bioorg Med Chem Lett 14: 1229-34 (2004)
Article DOI: 10.1016/j.bmcl.2003.12.054
BindingDB Entry DOI: 10.7270/Q2QN6664