BDBM50140444 1-(3-Fluoro-naphthalen-2-yl)-1H-tetrazole-5-carboxylic acid [2-fluoro-4-(imino-pyrrolidin-1-yl-methyl)-phenyl]-amide::CHEMBL282945
SMILES: Fc1cc(ccc1NC(=O)c1nnnn1-c1cc2ccccc2cc1F)C(=N)N1CCCC1
InChI Key: InChIKey=JLIOHWNTJTXGTP-UHFFFAOYSA-N
Data: 1 IC50
Activity Spreadsheet -- Enzyme Inhibition Constant Data from BindingDB
Found 1 hit for monomerid = 50140444
Trg + Lig
Ki
nM
ΔG°
kcal/mole
IC50
nM
Kd
nM
EC50/IC50
nM
koff
s-1
kon
M-1s-1
pHTemp
°C
Coagulation factor X
(Homo sapiens (Human))
BDBM50140444
(1-(3-Fluoro-naphthalen-2-yl)-1H-tetrazole-5-carbox...)
Show SMILES Fc1cc(ccc1NC(=O)c1nnnn1-c1cc2ccccc2cc1F)C(=N)N1CCCC1
Show InChI InChI=1S/C23H19F2N7O/c24-17-12-16(21(26)31-9-3-4-10-31)7-8-19(17)27-23(33)22-28-29-30-32(22)20-13-15-6-2-1-5-14(15)11-18(20)25/h1-2,5-8,11-13,26H,3-4,9-10H2,(H,27,33)
Reactome pathway
n/an/a 24n/an/an/an/an/an/a
Millennium Pharmaceuticals Inc.
Curated by ChEMBL
Assay Description
In vitro inhibitory activity against human coagulation factor X
Bioorg Med Chem Lett 14: 1229-34 (2004)
Article DOI: 10.1016/j.bmcl.2003.12.054
BindingDB Entry DOI: 10.7270/Q2QN6664