BDBM50140445 2-(3-Fluoro-naphthalen-2-yl)-5-methyl-2H-pyrazole-3-carboxylic acid {2-fluoro-4-[N-(2-methoxy-ethyl)-N-methyl-carbamimidoyl]-phenyl}-amide::CHEMBL20567
SMILES: COCCN(C)C(=N)c1ccc(NC(=O)c2cc(C)nn2-c2cc3ccccc3cc2F)c(F)c1
InChI Key: InChIKey=LSDMCWHOXLHTBD-UHFFFAOYSA-N
Data: 1 IC50
Activity Spreadsheet -- Enzyme Inhibition Constant Data from BindingDB
Found 1 hit for monomerid = 50140445
Trg + Lig
Ki
nM
ΔG°
kcal/mole
IC50
nM
Kd
nM
EC50/IC50
nM
koff
s-1
kon
M-1s-1
pHTemp
°C
Coagulation factor X
(Homo sapiens (Human))
BDBM50140445
(2-(3-Fluoro-naphthalen-2-yl)-5-methyl-2H-pyrazole-...)
Show SMILES COCCN(C)C(=N)c1ccc(NC(=O)c2cc(C)nn2-c2cc3ccccc3cc2F)c(F)c1
Show InChI InChI=1S/C26H25F2N5O2/c1-16-12-24(33(31-16)23-15-18-7-5-4-6-17(18)13-21(23)28)26(34)30-22-9-8-19(14-20(22)27)25(29)32(2)10-11-35-3/h4-9,12-15,29H,10-11H2,1-3H3,(H,30,34)
Reactome pathway
n/an/a 110n/an/an/an/an/an/a
Millennium Pharmaceuticals Inc.
Curated by ChEMBL
Assay Description
In vitro inhibitory activity against human coagulation factor X
Bioorg Med Chem Lett 14: 1229-34 (2004)
Article DOI: 10.1016/j.bmcl.2003.12.054
BindingDB Entry DOI: 10.7270/Q2QN6664