BDBM50140520 CHEMBL23176::[4-((S)-1-Amino-2-oxo-2-thiazolidin-3-yl-ethyl)-cyclohexyl]-carbamic acid benzyl ester
SMILES: N[C@@H]([C@H]1CC[C@@H](CC1)NC(=O)OCc1ccccc1)C(=O)N1CCSC1
InChI Key: InChIKey=IMQBTVOWEGWZTQ-ULQDDVLXSA-N
Data: 2 IC50
Activity Spreadsheet -- Enzyme Inhibition Constant Data from BindingDB
Found 2 hits for monomerid = 50140520
Trg + Lig
Ki
nM
ΔG°
kcal/mole
IC50
nM
Kd
nM
EC50/IC50
nM
koff
s-1
kon
M-1s-1
pHTemp
°C
Dipeptidyl peptidase 4
(Homo sapiens (Human))
BDBM50140520
(CHEMBL23176 | [4-((S)-1-Amino-2-oxo-2-thiazolidin-...)
Show SMILES N[C@@H]([C@H]1CC[C@@H](CC1)NC(=O)OCc1ccccc1)C(=O)N1CCSC1 |wU:5.8,1.0,wD:2.7,(4.17,-4.08,;4.17,-2.53,;2.84,-1.76,;2.84,-.21,;1.5,.56,;.17,-.21,;.17,-1.76,;1.5,-2.53,;-1.18,.58,;-2.52,-.17,;-2.52,-1.74,;-3.85,.58,;-3.86,2.13,;-5.19,2.9,;-6.52,2.13,;-7.87,2.89,;-7.87,4.44,;-6.52,5.21,;-5.19,4.44,;5.5,-1.76,;5.5,-.21,;6.85,-2.53,;8.19,-1.76,;9.34,-2.81,;8.71,-4.19,;7.18,-4.05,)|
Show InChI InChI=1S/C19H27N3O3S/c20-17(18(23)22-10-11-26-13-22)15-6-8-16(9-7-15)21-19(24)25-12-14-4-2-1-3-5-14/h1-5,15-17H,6-13,20H2,(H,21,24)/t15-,16-,17-/m0/s1
Reactome pathway
n/an/a 25n/an/an/an/an/an/a
Merck Research Laboratories
Curated by ChEMBL
Assay Description
Inhibitory activity against human Dipeptidyl-peptidase IV
Bioorg Med Chem Lett 14: 1265-8 (2004)
Article DOI: 10.1016/j.bmcl.2003.12.040
BindingDB Entry DOI: 10.7270/Q2G73D5Q
Dipeptidyl peptidase 2 (DPP II)
(Homo sapiens (Human))
BDBM50140520
(CHEMBL23176 | [4-((S)-1-Amino-2-oxo-2-thiazolidin-...)
Show SMILES N[C@@H]([C@H]1CC[C@@H](CC1)NC(=O)OCc1ccccc1)C(=O)N1CCSC1 |wU:5.8,1.0,wD:2.7,(4.17,-4.08,;4.17,-2.53,;2.84,-1.76,;2.84,-.21,;1.5,.56,;.17,-.21,;.17,-1.76,;1.5,-2.53,;-1.18,.58,;-2.52,-.17,;-2.52,-1.74,;-3.85,.58,;-3.86,2.13,;-5.19,2.9,;-6.52,2.13,;-7.87,2.89,;-7.87,4.44,;-6.52,5.21,;-5.19,4.44,;5.5,-1.76,;5.5,-.21,;6.85,-2.53,;8.19,-1.76,;9.34,-2.81,;8.71,-4.19,;7.18,-4.05,)|
Show InChI InChI=1S/C19H27N3O3S/c20-17(18(23)22-10-11-26-13-22)15-6-8-16(9-7-15)21-19(24)25-12-14-4-2-1-3-5-14/h1-5,15-17H,6-13,20H2,(H,21,24)/t15-,16-,17-/m0/s1
n/an/a 900n/an/an/an/an/an/a
Merck Research Laboratories
Curated by ChEMBL
Assay Description
Inhibitory activity against human quiescent cell proline dipeptidase (QPP) enzyme
Bioorg Med Chem Lett 14: 1265-8 (2004)
Article DOI: 10.1016/j.bmcl.2003.12.040
BindingDB Entry DOI: 10.7270/Q2G73D5Q