BDBM50140566 CHEMBL3754383
SMILES: OC(=O)CCNc1nc(cc(n1)-n1cc2ccccc2n1)N1CCc2ccccc2C1
InChI Key: InChIKey=QETJYHWPQGQNPY-UHFFFAOYSA-N
Data: 1 IC50
Activity Spreadsheet -- Enzyme Inhibition Constant Data from BindingDB
Found 1 hit for monomerid = 50140566
Trg + Lig
Ki
nM
ΔG°
kcal/mole
IC50
nM
Kd
nM
EC50/IC50
nM
koff
s-1
kon
M-1s-1
pHTemp
°C
Lysine-specific demethylase 6B
(Homo sapiens (Human))
BDBM50140566
(CHEMBL3754383)
Show SMILES OC(=O)CCNc1nc(cc(n1)-n1cc2ccccc2n1)N1CCc2ccccc2C1
Show InChI InChI=1S/C23H22N6O2/c30-22(31)9-11-24-23-25-20(28-12-10-16-5-1-2-6-17(16)14-28)13-21(26-23)29-15-18-7-3-4-8-19(18)27-29/h1-8,13,15H,9-12,14H2,(H,30,31)(H,24,25,26)
n/an/a 6.10E+3n/an/an/an/an/an/a
Chinese Academy of Sciences
Curated by ChEMBL
Assay Description
Inhibition of JMJD3 (unknown origin) using biotinylated H3K27me3 peptide as substrate after 1 hr by AlphaLISA assay
Bioorg Med Chem Lett 26: 721-5 (2016)
BindingDB Entry DOI: 10.7270/Q2P55QC2