BDBM50140582 (R)-3-(3-bromo-4-hydroxybenzyl)-7-benzyl-5-ethyl-2-methoxy-7,8-dihydro-3H-imidazo[2,1-e]purin-4(5H)-one::7-benzyl-3-(3-bromo-4-hydroxybenzyl)-5-ethyl-2-methoxy-(7R)-4,5,7,8-tetrahydro-3H-imidazo[2,1-b]purin-4-one::CHEMBL23308
SMILES: CCN1C2=N[C@H](Cc3ccccc3)CN2c2nc(OC)n(Cc3ccc(O)c(Br)c3)c2C1=O
InChI Key: InChIKey=YBNRNXVMEOLRGD-QGZVFWFLSA-N
Data: 2 IC50
Activity Spreadsheet -- Enzyme Inhibition Constant Data from BindingDB
Found 2 hits for monomerid = 50140582
Trg + Lig
Ki
nM
ΔG°
kcal/mole
IC50
nM
Kd
nM
EC50/IC50
nM
koff
s-1
kon
M-1s-1
pHTemp
°C
cGMP-specific 3',5'-cyclic phosphodiesterase
(Homo sapiens (Human))
BDBM50140582
((R)-3-(3-bromo-4-hydroxybenzyl)-7-benzyl-5-ethyl-2...)
Show SMILES CCN1C2=N[C@H](Cc3ccccc3)CN2c2nc(OC)n(Cc3ccc(O)c(Br)c3)c2C1=O |r,t:3|
Show InChI InChI=1S/C24H24BrN5O3/c1-3-28-22(32)20-21(30-14-17(26-23(28)30)11-15-7-5-4-6-8-15)27-24(33-2)29(20)13-16-9-10-19(31)18(25)12-16/h4-10,12,17,31H,3,11,13-14H2,1-2H3/t17-/m1/s1
Reactome pathway
n/an/a 1.30n/an/an/an/an/an/a
Universidade Federal de Lavras-UFLA
Curated by ChEMBL
Assay Description
Inhibition of PDE5
Eur J Med Chem 43: 1632-8 (2008)
Article DOI: 10.1016/j.ejmech.2007.10.019
BindingDB Entry DOI: 10.7270/Q2Q81F9P
cGMP-specific 3',5'-cyclic phosphodiesterase
(Homo sapiens (Human))
BDBM50140582
((R)-3-(3-bromo-4-hydroxybenzyl)-7-benzyl-5-ethyl-2...)
Show SMILES CCN1C2=N[C@H](Cc3ccccc3)CN2c2nc(OC)n(Cc3ccc(O)c(Br)c3)c2C1=O |r,t:3|
Show InChI InChI=1S/C24H24BrN5O3/c1-3-28-22(32)20-21(30-14-17(26-23(28)30)11-15-7-5-4-6-8-15)27-24(33-2)29(20)13-16-9-10-19(31)18(25)12-16/h4-10,12,17,31H,3,11,13-14H2,1-2H3/t17-/m1/s1
Reactome pathway
n/an/a 1.30n/an/an/an/an/an/a
Schering-Plough Research Institute
Curated by ChEMBL
Assay Description
Inhibitory concentration against human phosphodiesterase 5 (PDE5) enzyme
Bioorg Med Chem Lett 14: 1291-4 (2004)
Article DOI: 10.1016/j.bmcl.2003.12.027
BindingDB Entry DOI: 10.7270/Q2BG2NF0