BDBM50140769 CHEMBL3754502
SMILES: CS(=O)(=O)N(CC(O)Cn1c2ccccc2c2ccccc12)c1ccccc1F
InChI Key: InChIKey=FBEHMXAMJFAZAR-UHFFFAOYSA-N
Data: 1 EC50
Activity Spreadsheet -- Enzyme Inhibition Constant Data from BindingDB
Found 1 hit for monomerid = 50140769
Trg + Lig
Ki
nM
ΔG°
kcal/mole
IC50
nM
Kd
nM
EC50/IC50
nM
koff
s-1
kon
M-1s-1
pHTemp
°C
Period circadian protein homolog 2
(Homo sapiens (Human))
BDBM50140769
(CHEMBL3754502)
Show SMILES CS(=O)(=O)N(CC(O)Cn1c2ccccc2c2ccccc12)c1ccccc1F
Show InChI InChI=1S/C22H21FN2O3S/c1-29(27,28)25(22-13-7-4-10-19(22)23)15-16(26)14-24-20-11-5-2-8-17(20)18-9-3-6-12-21(18)24/h2-13,16,26H,14-15H2,1H3
n/an/an/an/a 2.55E+3n/an/an/an/a
Reset Therapeutics
Curated by ChEMBL
Assay Description
Reduction of amplitude effect of PER2 in human U2OS cells harboring Per2-dLuc luciferase reporter gene assessed as effects on circadian rhythms
Bioorg Med Chem Lett 26: 757-60 (2016)
BindingDB Entry DOI: 10.7270/Q2DR2XCS