BDBM50141091 CHEMBL3752475
SMILES: [H][C@@]12CC=C3C=C(CC[C@]3(C)[C@@]1([H])CC[C@]1(C)NC(=O)CC[C@@]21[H])c1nnn[nH]1
InChI Key: InChIKey=WRAXYRCDSVZVRY-MWTROVGWSA-N
Data: 1 IC50
Activity Spreadsheet -- Enzyme Inhibition Constant Data from BindingDB
Found 1 hit for monomerid = 50141091
Trg + Lig
Ki
nM
ΔG°
kcal/mole
IC50
nM
Kd
nM
EC50/IC50
nM
koff
s-1
kon
M-1s-1
pHTemp
°C
Steroid 5-alpha-reductase
(Homo sapiens (Human))
BDBM50141091
(CHEMBL3752475)
Show SMILES [H][C@@]12CC=C3C=C(CC[C@]3(C)[C@@]1([H])CC[C@]1(C)NC(=O)CC[C@@]21[H])c1nnn[nH]1 |r,c:5,t:3|
Show InChI InChI=1S/C20H27N5O/c1-19-9-7-12(18-22-24-25-23-18)11-13(19)3-4-14-15(19)8-10-20(2)16(14)5-6-17(26)21-20/h3,11,14-16H,4-10H2,1-2H3,(H,21,26)(H,22,23,24,25)/t14-,15+,16+,19+,20+/m1/s1
Reactome pathway
n/an/a 220n/an/an/an/an/an/a
University Institute of Pharmaceutical Sciences
Curated by ChEMBL
Assay Description
Inhibition of human 5alpha-2 reductase expressed in HEK293 cells assessed as suppression of conversion of [3]androstenedione incubated for 30 mins by...
Bioorg Med Chem 24: 779-88 (2016)
BindingDB Entry DOI: 10.7270/Q21G0P3C