null
SMILES: [O-]C(=O)C(=O)CC(=O)c1ccc(CN=[N+]=[N-])c(CN=[N+]=[N-])c1
InChI Key: InChIKey=XTPDVWFMMFGCKG-UHFFFAOYSA-M
Activity Spreadsheet -- Enzyme Inhibition Constant Data from BindingDB
Found 1 hit for monomerid = 50141240
Trg + Lig
Ki
nM
ΔG°
kcal/mole
IC50
nM
Kd
nM
EC50/IC50
nM
koff
s-1
kon
M-1s-1
pHTemp
°C
Integrase
(Human immunodeficiency virus 1)
BDBM50141240
((Z)-4-(3,4-Bis-azidomethyl-phenyl)-2-hydroxy-4-oxo...)
Show SMILES [O-]C(=O)C(=O)CC(=O)c1ccc(CN=[N+]=[N-])c(CN=[N+]=[N-])c1
Show InChI InChI=1S/C12H10N6O4/c13-17-15-5-8-2-1-7(3-9(8)6-16-18-14)10(19)4-11(20)12(21)22/h1-3H,4-6H2,(H,21,22)/p-1
n/an/a 260n/an/an/an/an/an/a
University of Houston
Curated by ChEMBL
Assay Description
Inhibitory activity against HIV-1 integrase
Bioorg Med Chem Lett 14: 1447-54 (2004)
Article DOI: 10.1016/j.bmcl.2004.01.027
BindingDB Entry DOI: 10.7270/Q2B858PN